BDBM50376466 CHEMBL437835
SMILES: Fc1ccc(F)c(c1)-c1ccc2N=C(CC(=O)Nc2c1)c1cccc(c1)-n1ccnc1
InChI Key: InChIKey=PKQZPUFBOAOAIO-UHFFFAOYSA-N
Data: 2 IC50
Activity Spreadsheet -- Enzyme Inhibition Constant Data from BindingDB
Found 2 hits for monomerid = 50376466
Trg + Lig
Ki
nM
ΔG°
kcal/mole
IC50
nM
Kd
nM
EC50/IC50
nM
koff
s-1
kon
M-1s-1
pHTemp
°C
Metabotropic glutamate receptor 2
(Homo sapiens (Human))
BDBM50376466
(CHEMBL437835)
Show SMILES Fc1ccc(F)c(c1)-c1ccc2N=C(CC(=O)Nc2c1)c1cccc(c1)-n1ccnc1 |c:13|
Show InChI InChI=1S/C24H16F2N4O/c25-17-5-6-20(26)19(12-17)15-4-7-21-23(11-15)29-24(31)13-22(28-21)16-2-1-3-18(10-16)30-9-8-27-14-30/h1-12,14H,13H2,(H,29,31)
n/an/a 7n/an/an/an/an/an/a
F. Hoffmann-La Roche Ltd.
Curated by ChEMBL
Assay Description
Displacement of [3H]LY354740 from rat mGluR2
Bioorg Med Chem Lett 18: 2725-9 (2008)
Article DOI: 10.1016/j.bmcl.2008.02.076
BindingDB Entry DOI: 10.7270/Q2S75H7D
Metabotropic glutamate receptor 2
(Homo sapiens (Human))
BDBM50376466
(CHEMBL437835)
Show SMILES Fc1ccc(F)c(c1)-c1ccc2N=C(CC(=O)Nc2c1)c1cccc(c1)-n1ccnc1 |c:13|
Show InChI InChI=1S/C24H16F2N4O/c25-17-5-6-20(26)19(12-17)15-4-7-21-23(11-15)29-24(31)13-22(28-21)16-2-1-3-18(10-16)30-9-8-27-14-30/h1-12,14H,13H2,(H,29,31)
n/an/a 17n/an/an/an/an/an/a
F. Hoffmann-La Roche Ltd.
Curated by ChEMBL
Assay Description
Antagonist activity at rat mGluR2 assessed as blockade of (1S,3R)-ACPD-induced inhibition of forskolin-stimulated cAMP production
Bioorg Med Chem Lett 18: 2725-9 (2008)
Article DOI: 10.1016/j.bmcl.2008.02.076
BindingDB Entry DOI: 10.7270/Q2S75H7D