BDBM50376474 CHEMBL259924
SMILES: CN(C)c1cc2N=C(CC(=O)Nc2cc1C(F)(F)F)c1cccc(c1)-n1ccnn1
InChI Key: InChIKey=RLLJZZRODXMVCW-UHFFFAOYSA-N
Data: 2 IC50
Activity Spreadsheet -- Enzyme Inhibition Constant Data from BindingDB
Found 2 hits for monomerid = 50376474
Trg + Lig
Ki
nM
ΔG°
kcal/mole
IC50
nM
Kd
nM
EC50/IC50
nM
koff
s-1
kon
M-1s-1
pHTemp
°C
Metabotropic glutamate receptor 2
(Homo sapiens (Human))
BDBM50376474
(CHEMBL259924)
Show SMILES CN(C)c1cc2N=C(CC(=O)Nc2cc1C(F)(F)F)c1cccc(c1)-n1ccnn1 |c:6|
Show InChI InChI=1S/C20H17F3N6O/c1-28(2)18-10-17-16(9-14(18)20(21,22)23)26-19(30)11-15(25-17)12-4-3-5-13(8-12)29-7-6-24-27-29/h3-10H,11H2,1-2H3,(H,26,30)
n/an/a 184n/an/an/an/an/an/a
F. Hoffmann-La Roche Ltd.
Curated by ChEMBL
Assay Description
Antagonist activity at rat mGluR2 assessed as blockade of (1S,3R)-ACPD-induced inhibition of forskolin-stimulated cAMP production
Bioorg Med Chem Lett 18: 2725-9 (2008)
Article DOI: 10.1016/j.bmcl.2008.02.076
BindingDB Entry DOI: 10.7270/Q2S75H7D
Metabotropic glutamate receptor 2
(Homo sapiens (Human))
BDBM50376474
(CHEMBL259924)
Show SMILES CN(C)c1cc2N=C(CC(=O)Nc2cc1C(F)(F)F)c1cccc(c1)-n1ccnn1 |c:6|
Show InChI InChI=1S/C20H17F3N6O/c1-28(2)18-10-17-16(9-14(18)20(21,22)23)26-19(30)11-15(25-17)12-4-3-5-13(8-12)29-7-6-24-27-29/h3-10H,11H2,1-2H3,(H,26,30)
n/an/a 38n/an/an/an/an/an/a
F. Hoffmann-La Roche Ltd.
Curated by ChEMBL
Assay Description
Displacement of [3H]LY354740 from rat mGluR2
Bioorg Med Chem Lett 18: 2725-9 (2008)
Article DOI: 10.1016/j.bmcl.2008.02.076
BindingDB Entry DOI: 10.7270/Q2S75H7D