BDBM50376480 CHEMBL409638
SMILES: Fc1ccc(cc1)-c1ccc2N=C(CC(=O)Nc2c1)c1cccc(c1)-n1ccnn1
InChI Key: InChIKey=KMKWIXWGWYUKBT-UHFFFAOYSA-N
Data: 2 IC50
Activity Spreadsheet -- Enzyme Inhibition Constant Data from BindingDB
Found 2 hits for monomerid = 50376480
Trg + Lig
Ki
nM
ΔG°
kcal/mole
IC50
nM
Kd
nM
EC50/IC50
nM
koff
s-1
kon
M-1s-1
pHTemp
°C
Metabotropic glutamate receptor 2
(Homo sapiens (Human))
BDBM50376480
(CHEMBL409638)
Show SMILES Fc1ccc(cc1)-c1ccc2N=C(CC(=O)Nc2c1)c1cccc(c1)-n1ccnn1 |c:12|
Show InChI InChI=1S/C23H16FN5O/c24-18-7-4-15(5-8-18)16-6-9-20-22(13-16)27-23(30)14-21(26-20)17-2-1-3-19(12-17)29-11-10-25-28-29/h1-13H,14H2,(H,27,30)
n/an/a 36n/an/an/an/an/an/a
F. Hoffmann-La Roche Ltd.
Curated by ChEMBL
Assay Description
Antagonist activity at rat mGluR2 assessed as blockade of (1S,3R)-ACPD-induced inhibition of forskolin-stimulated cAMP production
Bioorg Med Chem Lett 18: 2725-9 (2008)
Article DOI: 10.1016/j.bmcl.2008.02.076
BindingDB Entry DOI: 10.7270/Q2S75H7D
Metabotropic glutamate receptor 2
(Homo sapiens (Human))
BDBM50376480
(CHEMBL409638)
Show SMILES Fc1ccc(cc1)-c1ccc2N=C(CC(=O)Nc2c1)c1cccc(c1)-n1ccnn1 |c:12|
Show InChI InChI=1S/C23H16FN5O/c24-18-7-4-15(5-8-18)16-6-9-20-22(13-16)27-23(30)14-21(26-20)17-2-1-3-19(12-17)29-11-10-25-28-29/h1-13H,14H2,(H,27,30)
n/an/a 31n/an/an/an/an/an/a
F. Hoffmann-La Roche Ltd.
Curated by ChEMBL
Assay Description
Displacement of [3H]LY354740 from rat mGluR2
Bioorg Med Chem Lett 18: 2725-9 (2008)
Article DOI: 10.1016/j.bmcl.2008.02.076
BindingDB Entry DOI: 10.7270/Q2S75H7D