BDBM50376483 CHEMBL263906
SMILES: FC(F)(F)c1ccc2N=C(CC(=O)Nc2c1)c1cccc(c1)-n1ccnc1
InChI Key: InChIKey=JPQSCPHZJNQZLD-UHFFFAOYSA-N
Data: 1 IC50
Activity Spreadsheet -- Enzyme Inhibition Constant Data from BindingDB
Found 1 hit for monomerid = 50376483
Trg + Lig
Ki
nM
ΔG°
kcal/mole
IC50
nM
Kd
nM
EC50/IC50
nM
koff
s-1
kon
M-1s-1
pHTemp
°C
Metabotropic glutamate receptor 2
(Homo sapiens (Human))
BDBM50376483
(CHEMBL263906)
Show SMILES FC(F)(F)c1ccc2N=C(CC(=O)Nc2c1)c1cccc(c1)-n1ccnc1 |c:8|
Show InChI InChI=1S/C19H13F3N4O/c20-19(21,22)13-4-5-15-17(9-13)25-18(27)10-16(24-15)12-2-1-3-14(8-12)26-7-6-23-11-26/h1-9,11H,10H2,(H,25,27)
n/an/a 43n/an/an/an/an/an/a
F. Hoffmann-La Roche Ltd.
Curated by ChEMBL
Assay Description
Displacement of [3H]LY354740 from rat mGluR2
Bioorg Med Chem Lett 18: 2725-9 (2008)
Article DOI: 10.1016/j.bmcl.2008.02.076
BindingDB Entry DOI: 10.7270/Q2S75H7D