BDBM50377020 CHEMBL257768
SMILES: OC[C@@H](C1CCN(CC1)C(=O)\C=C\c1cc(F)c(F)c(F)c1)N1CCC(CC1)c1c[nH]c2ccccc12
InChI Key: InChIKey=KXZARDUIYCLEFF-BLRKDVCKSA-N
Data: 1 IC50
Activity Spreadsheet -- Enzyme Inhibition Constant Data from BindingDB
Found 1 hit for monomerid = 50377020
Trg + Lig
Ki
nM
ΔG°
kcal/mole
IC50
nM
Kd
nM
EC50/IC50
nM
koff
s-1
kon
M-1s-1
pHTemp
°C
C-C chemokine receptor type 2
(Homo sapiens (Human))
BDBM50377020
(CHEMBL257768)
Show SMILES OC[C@@H](C1CCN(CC1)C(=O)\C=C\c1cc(F)c(F)c(F)c1)N1CCC(CC1)c1c[nH]c2ccccc12
Show InChI InChI=1S/C29H32F3N3O2/c30-24-15-19(16-25(31)29(24)32)5-6-28(37)35-13-9-21(10-14-35)27(18-36)34-11-7-20(8-12-34)23-17-33-26-4-2-1-3-22(23)26/h1-6,15-17,20-21,27,33,36H,7-14,18H2/b6-5+/t27-/m0/s1
n/an/a 10n/an/an/an/an/an/a
Johnson& Johnson Pharmaceutical Research and Development
Curated by ChEMBL
Assay Description
Binding affinity at human CCR2 receptor
Bioorg Med Chem Lett 18: 3562-4 (2008)
Article DOI: 10.1016/j.bmcl.2008.05.010
BindingDB Entry DOI: 10.7270/Q2Q52QGK