BDBM50377022 CHEMBL403581
SMILES: OCC(C1CCN(CC1)C(=O)Nc1ccc(Cl)c(Cl)c1)N1CCC(CC1)c1c[nH]c2ccc(cc12)C(O)=O
InChI Key: InChIKey=OUWWPJCXSHFDPP-UHFFFAOYSA-N
Data: 1 IC50
Activity Spreadsheet -- Enzyme Inhibition Constant Data from BindingDB
Found 1 hit for monomerid = 50377022
Trg + Lig
Ki
nM
ΔG°
kcal/mole
IC50
nM
Kd
nM
EC50/IC50
nM
koff
s-1
kon
M-1s-1
pHTemp
°C
C-C chemokine receptor type 2
(Homo sapiens (Human))
BDBM50377022
(CHEMBL403581)
Show SMILES OCC(C1CCN(CC1)C(=O)Nc1ccc(Cl)c(Cl)c1)N1CCC(CC1)c1c[nH]c2ccc(cc12)C(O)=O |w:2.1|
Show InChI InChI=1S/C28H32Cl2N4O4/c29-23-3-2-20(14-24(23)30)32-28(38)34-11-7-18(8-12-34)26(16-35)33-9-5-17(6-10-33)22-15-31-25-4-1-19(27(36)37)13-21(22)25/h1-4,13-15,17-18,26,31,35H,5-12,16H2,(H,32,38)(H,36,37)
n/an/a 10n/an/an/an/an/an/a
Johnson& Johnson Pharmaceutical Research and Development
Curated by ChEMBL
Assay Description
Binding affinity at human CCR2 receptor
Bioorg Med Chem Lett 18: 3562-4 (2008)
Article DOI: 10.1016/j.bmcl.2008.05.010
BindingDB Entry DOI: 10.7270/Q2Q52QGK