BDBM50377169 CHEMBL402629
SMILES: COc1ccc2ncc(-c3cccc(NC4CCNCC4)n3)n2c1
InChI Key: InChIKey=QTFQLQSPZXWTOC-UHFFFAOYSA-N
Data: 2 IC50
Activity Spreadsheet -- Enzyme Inhibition Constant Data from BindingDB
Found 2 hits for monomerid = 50377169
Trg + Lig
Ki
nM
ΔG°
kcal/mole
IC50
nM
Kd
nM
EC50/IC50
nM
koff
s-1
kon
M-1s-1
pHTemp
°C
Interleukin-1 receptor-associated kinase 1
(Homo sapiens (Human))
BDBM50377169
(CHEMBL402629)
Show SMILES COc1ccc2ncc(-c3cccc(NC4CCNCC4)n3)n2c1
Show InChI InChI=1S/C18H21N5O/c1-24-14-5-6-18-20-11-16(23(18)12-14)15-3-2-4-17(22-15)21-13-7-9-19-10-8-13/h2-6,11-13,19H,7-10H2,1H3,(H,21,22)
n/an/a 2.93E+5n/an/an/an/an/an/a
UCB
Curated by ChEMBL
Assay Description
Inhibition of IRAK1
Bioorg Med Chem Lett 18: 3656-60 (2008)
Article DOI: 10.1016/j.bmcl.2008.04.042
BindingDB Entry DOI: 10.7270/Q2JH3N2N
Interleukin-1 receptor-associated kinase 4
(Homo sapiens (Human))
BDBM50377169
(CHEMBL402629)
Show SMILES COc1ccc2ncc(-c3cccc(NC4CCNCC4)n3)n2c1
Show InChI InChI=1S/C18H21N5O/c1-24-14-5-6-18-20-11-16(23(18)12-14)15-3-2-4-17(22-15)21-13-7-9-19-10-8-13/h2-6,11-13,19H,7-10H2,1H3,(H,21,22)
Reactome pathway
n/an/a 6n/an/an/an/an/an/a
UCB
Curated by ChEMBL
Assay Description
Inhibition of IRAK4
Bioorg Med Chem Lett 18: 3656-60 (2008)
Article DOI: 10.1016/j.bmcl.2008.04.042
BindingDB Entry DOI: 10.7270/Q2JH3N2N