null
SMILES: OC(=O)c1ccc(Nc2ncc3nnn(-c4ccccc4)c3n2)cc1
InChI Key: InChIKey=SRUYEOQJIXGTDT-UHFFFAOYSA-N
Activity Spreadsheet -- Enzyme Inhibition Constant Data from BindingDB
Found 3 hits for monomerid = 50377241
Trg + Lig
Ki
nM
ΔG°
kcal/mole
IC50
nM
Kd
nM
EC50/IC50
nM
koff
s-1
kon
M-1s-1
pHTemp
°C
Glycogen synthase kinase-3 alpha
(Homo sapiens (Human))
BDBM50377241
(CHEMBL402932)
Show SMILES OC(=O)c1ccc(Nc2ncc3nnn(-c4ccccc4)c3n2)cc1
Show InChI InChI=1S/C17H12N6O2/c24-16(25)11-6-8-12(9-7-11)19-17-18-10-14-15(20-17)23(22-21-14)13-4-2-1-3-5-13/h1-10H,(H,24,25)(H,18,19,20)
NCI pathway
Reactome pathway
n/an/a 32n/an/an/an/an/an/a
Kemia, Inc.
Curated by ChEMBL
Assay Description
Inhibition of GSK3alpha
Bioorg Med Chem Lett 18: 3578-81 (2008)
Article DOI: 10.1016/j.bmcl.2008.05.001
BindingDB Entry DOI: 10.7270/Q2571CXM
Glycogen synthase kinase-3 beta
(Homo sapiens (Human))
BDBM50377241
(CHEMBL402932)
Show SMILES OC(=O)c1ccc(Nc2ncc3nnn(-c4ccccc4)c3n2)cc1
Show InChI InChI=1S/C17H12N6O2/c24-16(25)11-6-8-12(9-7-11)19-17-18-10-14-15(20-17)23(22-21-14)13-4-2-1-3-5-13/h1-10H,(H,24,25)(H,18,19,20)
NCI pathway
Reactome pathway
n/an/a 49n/an/an/an/an/an/a
Kemia, Inc.
Curated by ChEMBL
Assay Description
Inhibition of GSK3-beta
Bioorg Med Chem Lett 18: 3578-81 (2008)
Article DOI: 10.1016/j.bmcl.2008.05.001
BindingDB Entry DOI: 10.7270/Q2571CXM
Aurora kinase A
(Homo sapiens (Human))
BDBM50377241
(CHEMBL402932)
Show SMILES OC(=O)c1ccc(Nc2ncc3nnn(-c4ccccc4)c3n2)cc1
Show InChI InChI=1S/C17H12N6O2/c24-16(25)11-6-8-12(9-7-11)19-17-18-10-14-15(20-17)23(22-21-14)13-4-2-1-3-5-13/h1-10H,(H,24,25)(H,18,19,20)
NCI pathway
Reactome pathway
n/an/a 292n/an/an/an/an/an/a
Kemia, Inc.
Curated by ChEMBL
Assay Description
Inhibition of Aurora A
Bioorg Med Chem Lett 18: 3578-81 (2008)
Article DOI: 10.1016/j.bmcl.2008.05.001
BindingDB Entry DOI: 10.7270/Q2571CXM