null
SMILES: OC(=O)c1ccc(Nc2ncc(c(Nc3ccccc3)n2)[N+]([O-])=O)cc1
InChI Key: InChIKey=WMSHTIRWIOFMAY-UHFFFAOYSA-N
Activity Spreadsheet -- Enzyme Inhibition Constant Data from BindingDB
Found 3 hits for monomerid = 50377243
Trg + Lig
Ki
nM
ΔG°
kcal/mole
IC50
nM
Kd
nM
EC50/IC50
nM
koff
s-1
kon
M-1s-1
pHTemp
°C
Aurora kinase A
(Homo sapiens (Human))
BDBM50377243
(CHEMBL257188)
Show SMILES OC(=O)c1ccc(Nc2ncc(c(Nc3ccccc3)n2)[N+]([O-])=O)cc1
Show InChI InChI=1S/C17H13N5O4/c23-16(24)11-6-8-13(9-7-11)20-17-18-10-14(22(25)26)15(21-17)19-12-4-2-1-3-5-12/h1-10H,(H,23,24)(H2,18,19,20,21)
NCI pathway
Reactome pathway
n/an/a 346n/an/an/an/an/an/a
Kemia, Inc.
Curated by ChEMBL
Assay Description
Inhibition of Aurora A
Bioorg Med Chem Lett 18: 3578-81 (2008)
Article DOI: 10.1016/j.bmcl.2008.05.001
BindingDB Entry DOI: 10.7270/Q2571CXM
Glycogen synthase kinase-3 beta
(Homo sapiens (Human))
BDBM50377243
(CHEMBL257188)
Show SMILES OC(=O)c1ccc(Nc2ncc(c(Nc3ccccc3)n2)[N+]([O-])=O)cc1
Show InChI InChI=1S/C17H13N5O4/c23-16(24)11-6-8-13(9-7-11)20-17-18-10-14(22(25)26)15(21-17)19-12-4-2-1-3-5-12/h1-10H,(H,23,24)(H2,18,19,20,21)
NCI pathway
Reactome pathway
n/an/a 150n/an/an/an/an/an/a
Kemia, Inc.
Curated by ChEMBL
Assay Description
Inhibition of GSK3-beta
Bioorg Med Chem Lett 18: 3578-81 (2008)
Article DOI: 10.1016/j.bmcl.2008.05.001
BindingDB Entry DOI: 10.7270/Q2571CXM
Glycogen synthase kinase-3 alpha
(Homo sapiens (Human))
BDBM50377243
(CHEMBL257188)
Show SMILES OC(=O)c1ccc(Nc2ncc(c(Nc3ccccc3)n2)[N+]([O-])=O)cc1
Show InChI InChI=1S/C17H13N5O4/c23-16(24)11-6-8-13(9-7-11)20-17-18-10-14(22(25)26)15(21-17)19-12-4-2-1-3-5-12/h1-10H,(H,23,24)(H2,18,19,20,21)
NCI pathway
Reactome pathway
n/an/a 270n/an/an/an/an/an/a
Kemia, Inc.
Curated by ChEMBL
Assay Description
Inhibition of GSK3alpha
Bioorg Med Chem Lett 18: 3578-81 (2008)
Article DOI: 10.1016/j.bmcl.2008.05.001
BindingDB Entry DOI: 10.7270/Q2571CXM