BDBM50377285 CHEMBL255237
SMILES: COCCO\N=C\c1c(N)ncnc1Nc1ccc2n(Cc3cccc(F)c3)ncc2c1
InChI Key: InChIKey=KSGYKTRNRCPDHT-KVSWJAHQSA-N
Data: 2 IC50
PDB links: 1 PDB ID matches this monomer.
Activity Spreadsheet -- Enzyme Inhibition Constant Data from BindingDB
Found 2 hits for monomerid = 50377285
Trg + Lig
Ki
nM
ΔG°
kcal/mole
IC50
nM
Kd
nM
EC50/IC50
nM
koff
s-1
kon
M-1s-1
pHTemp
°C
Epidermal growth factor receptor
(Homo sapiens (Human))
BDBM50377285
(CHEMBL255237)
Show SMILES COCCO\N=C\c1c(N)ncnc1Nc1ccc2n(Cc3cccc(F)c3)ncc2c1
Show InChI InChI=1S/C22H22FN7O2/c1-31-7-8-32-28-12-19-21(24)25-14-26-22(19)29-18-5-6-20-16(10-18)11-27-30(20)13-15-3-2-4-17(23)9-15/h2-6,9-12,14H,7-8,13H2,1H3,(H3,24,25,26,29)/b28-12+
n/an/a 14n/an/an/an/an/an/a
Johnson& Johnson Pharmaceutical Research& Development
Curated by ChEMBL
Assay Description
Inhibition of EGFR
Bioorg Med Chem Lett 18: 3495-9 (2008)
Article DOI: 10.1016/j.bmcl.2008.05.024
BindingDB Entry DOI: 10.7270/Q21G0N5V
3D
3D Structure (crystal)
Receptor tyrosine-protein kinase erbB-2
(Homo sapiens (Human))
BDBM50377285
(CHEMBL255237)
Show SMILES COCCO\N=C\c1c(N)ncnc1Nc1ccc2n(Cc3cccc(F)c3)ncc2c1
Show InChI InChI=1S/C22H22FN7O2/c1-31-7-8-32-28-12-19-21(24)25-14-26-22(19)29-18-5-6-20-16(10-18)11-27-30(20)13-15-3-2-4-17(23)9-15/h2-6,9-12,14H,7-8,13H2,1H3,(H3,24,25,26,29)/b28-12+
n/an/a 6n/an/an/an/an/an/a
Johnson& Johnson Pharmaceutical Research& Development
Curated by ChEMBL
Assay Description
Inhibition of ErbB2
Bioorg Med Chem Lett 18: 3495-9 (2008)
Article DOI: 10.1016/j.bmcl.2008.05.024
BindingDB Entry DOI: 10.7270/Q21G0N5V