BDBM50377432 CHEMBL258927
SMILES: NCCCCCNc1c2CCCCc2nc2ccccc12
InChI Key: InChIKey=KBHOEIHLPXNPQK-UHFFFAOYSA-N
Data: 2 IC50
Activity Spreadsheet -- Enzyme Inhibition Constant Data from BindingDB
Found 2 hits for monomerid = 50377432
Trg + Lig
Ki
nM
ΔG°
kcal/mole
IC50
nM
Kd
nM
EC50/IC50
nM
koff
s-1
kon
M-1s-1
pHTemp
°C
Acetylcholinesterase
(Electrophorus electricus (Electric eel))
BDBM50377432
(CHEMBL258927)
Show SMILES NCCCCCNc1c2CCCCc2nc2ccccc12
Show InChI InChI=1S/C18H25N3/c19-12-6-1-7-13-20-18-14-8-2-4-10-16(14)21-17-11-5-3-9-15(17)18/h2,4,8,10H,1,3,5-7,9,11-13,19H2,(H,20,21)
n/an/a 3.20n/an/an/an/an/an/a
Friedrich-Schiller-Universit£t Jena
Curated by ChEMBL
Assay Description
Inhibition of electric eel AchE by Ellman's assay
Bioorg Med Chem Lett 18: 2905-9 (2008)
Article DOI: 10.1016/j.bmcl.2008.03.073
BindingDB Entry DOI: 10.7270/Q2M909KN
Butyrylcholinesterase (BChE)
(Equus caballus (Horse))
BDBM50377432
(CHEMBL258927)
Show SMILES NCCCCCNc1c2CCCCc2nc2ccccc12
Show InChI InChI=1S/C18H25N3/c19-12-6-1-7-13-20-18-14-8-2-4-10-16(14)21-17-11-5-3-9-15(17)18/h2,4,8,10H,1,3,5-7,9,11-13,19H2,(H,20,21)
n/an/a 5n/an/an/an/an/an/a
Friedrich-Schiller-Universit£t Jena
Curated by ChEMBL
Assay Description
Inhibition of equine BChE by Ellman's assay
Bioorg Med Chem Lett 18: 2905-9 (2008)
Article DOI: 10.1016/j.bmcl.2008.03.073
BindingDB Entry DOI: 10.7270/Q2M909KN