null
SMILES: FC(F)(F)c1cc(NC(=O)Nc2cccc(c2)-c2[nH]c(nc2-c2ccnc(NCCN3CCNC3=O)n2)C2CC2)ccc1Cl
InChI Key: InChIKey=ZTZSKHGZPQXQKE-UHFFFAOYSA-N
Activity Spreadsheet -- Enzyme Inhibition Constant Data from BindingDB
Found 2 hits for monomerid = 50377758
Trg + Lig
Ki
nM
ΔG°
kcal/mole
IC50
nM
Kd
nM
EC50/IC50
nM
koff
s-1
kon
M-1s-1
pHTemp
°C
RAF proto-oncogene serine/threonine-protein kinase
(Homo sapiens (Human))
BDBM50377758
(CHEMBL256921)
Show SMILES FC(F)(F)c1cc(NC(=O)Nc2cccc(c2)-c2[nH]c(nc2-c2ccnc(NCCN3CCNC3=O)n2)C2CC2)ccc1Cl
Show InChI InChI=1S/C29H27ClF3N9O2/c30-21-7-6-19(15-20(21)29(31,32)33)38-27(43)37-18-3-1-2-17(14-18)23-24(41-25(40-23)16-4-5-16)22-8-9-34-26(39-22)35-10-12-42-13-11-36-28(42)44/h1-3,6-9,14-16H,4-5,10-13H2,(H,36,44)(H,40,41)(H,34,35,39)(H2,37,38,43)
NCI pathway
Reactome pathway
n/an/a 14n/an/an/an/an/an/a
Johnson& Johnson Pharmaceutical Research& Development
Curated by ChEMBL
Assay Description
Inhibition of C-RAF kinase
Bioorg Med Chem Lett 18: 2825-9 (2008)
Article DOI: 10.1016/j.bmcl.2008.04.002
BindingDB Entry DOI: 10.7270/Q2DJ5GH8
Serine/threonine-protein kinase B-raf
(Homo sapiens (Human))
BDBM50377758
(CHEMBL256921)
Show SMILES FC(F)(F)c1cc(NC(=O)Nc2cccc(c2)-c2[nH]c(nc2-c2ccnc(NCCN3CCNC3=O)n2)C2CC2)ccc1Cl
Show InChI InChI=1S/C29H27ClF3N9O2/c30-21-7-6-19(15-20(21)29(31,32)33)38-27(43)37-18-3-1-2-17(14-18)23-24(41-25(40-23)16-4-5-16)22-8-9-34-26(39-22)35-10-12-42-13-11-36-28(42)44/h1-3,6-9,14-16H,4-5,10-13H2,(H,36,44)(H,40,41)(H,34,35,39)(H2,37,38,43)
NCI pathway
Reactome pathway
n/an/a 66n/an/an/an/an/an/a
Johnson& Johnson Pharmaceutical Research& Development
Curated by ChEMBL
Assay Description
Inhibition of B-RAF kinase
Bioorg Med Chem Lett 18: 2825-9 (2008)
Article DOI: 10.1016/j.bmcl.2008.04.002
BindingDB Entry DOI: 10.7270/Q2DJ5GH8