null
SMILES: Clc1ccc(CS(=O)(=O)Nc2cccc(c2)-c2[nH]c(nc2-c2ccnc(NCCN3CCNC3=O)n2)C2CC2)cc1Cl
InChI Key: InChIKey=NTUPINFPCXIWMM-UHFFFAOYSA-N
Activity Spreadsheet -- Enzyme Inhibition Constant Data from BindingDB
Found 2 hits for monomerid = 50377759
Trg + Lig
Ki
nM
ΔG°
kcal/mole
IC50
nM
Kd
nM
EC50/IC50
nM
koff
s-1
kon
M-1s-1
pHTemp
°C
RAF proto-oncogene serine/threonine-protein kinase
(Homo sapiens (Human))
BDBM50377759
(CHEMBL255497)
Show SMILES Clc1ccc(CS(=O)(=O)Nc2cccc(c2)-c2[nH]c(nc2-c2ccnc(NCCN3CCNC3=O)n2)C2CC2)cc1Cl
Show InChI InChI=1S/C28H28Cl2N8O3S/c29-21-7-4-17(14-22(21)30)16-42(40,41)37-20-3-1-2-19(15-20)24-25(36-26(35-24)18-5-6-18)23-8-9-31-27(34-23)32-10-12-38-13-11-33-28(38)39/h1-4,7-9,14-15,18,37H,5-6,10-13,16H2,(H,33,39)(H,35,36)(H,31,32,34)
NCI pathway
Reactome pathway
n/an/a 41n/an/an/an/an/an/a
Johnson& Johnson Pharmaceutical Research& Development
Curated by ChEMBL
Assay Description
Inhibition of C-RAF kinase
Bioorg Med Chem Lett 18: 2825-9 (2008)
Article DOI: 10.1016/j.bmcl.2008.04.002
BindingDB Entry DOI: 10.7270/Q2DJ5GH8
Serine/threonine-protein kinase B-raf
(Homo sapiens (Human))
BDBM50377759
(CHEMBL255497)
Show SMILES Clc1ccc(CS(=O)(=O)Nc2cccc(c2)-c2[nH]c(nc2-c2ccnc(NCCN3CCNC3=O)n2)C2CC2)cc1Cl
Show InChI InChI=1S/C28H28Cl2N8O3S/c29-21-7-4-17(14-22(21)30)16-42(40,41)37-20-3-1-2-19(15-20)24-25(36-26(35-24)18-5-6-18)23-8-9-31-27(34-23)32-10-12-38-13-11-33-28(38)39/h1-4,7-9,14-15,18,37H,5-6,10-13,16H2,(H,33,39)(H,35,36)(H,31,32,34)
NCI pathway
Reactome pathway
n/an/a 343n/an/an/an/an/an/a
Johnson& Johnson Pharmaceutical Research& Development
Curated by ChEMBL
Assay Description
Inhibition of B-RAF kinase
Bioorg Med Chem Lett 18: 2825-9 (2008)
Article DOI: 10.1016/j.bmcl.2008.04.002
BindingDB Entry DOI: 10.7270/Q2DJ5GH8