null
SMILES: CNc1nccc(n1)-c1nc([nH]c1-c1cccc(NS(=O)(=O)Cc2ccc(Cl)c(Cl)c2)c1)C1CC1
InChI Key: InChIKey=WFHIMRZMKUCYOZ-UHFFFAOYSA-N
Activity Spreadsheet -- Enzyme Inhibition Constant Data from BindingDB
Found 2 hits for monomerid = 50377769
Trg + Lig
Ki
nM
ΔG°
kcal/mole
IC50
nM
Kd
nM
EC50/IC50
nM
koff
s-1
kon
M-1s-1
pHTemp
°C
Serine/threonine-protein kinase B-raf
(Homo sapiens (Human))
BDBM50377769
(CHEMBL402029)
Show SMILES CNc1nccc(n1)-c1nc([nH]c1-c1cccc(NS(=O)(=O)Cc2ccc(Cl)c(Cl)c2)c1)C1CC1
Show InChI InChI=1S/C24H22Cl2N6O2S/c1-27-24-28-10-9-20(29-24)22-21(30-23(31-22)15-6-7-15)16-3-2-4-17(12-16)32-35(33,34)13-14-5-8-18(25)19(26)11-14/h2-5,8-12,15,32H,6-7,13H2,1H3,(H,30,31)(H,27,28,29)
NCI pathway
Reactome pathway
n/an/a 469n/an/an/an/an/an/a
Johnson& Johnson Pharmaceutical Research& Development
Curated by ChEMBL
Assay Description
Inhibition of B-RAF kinase
Bioorg Med Chem Lett 18: 2825-9 (2008)
Article DOI: 10.1016/j.bmcl.2008.04.002
BindingDB Entry DOI: 10.7270/Q2DJ5GH8
RAF proto-oncogene serine/threonine-protein kinase
(Homo sapiens (Human))
BDBM50377769
(CHEMBL402029)
Show SMILES CNc1nccc(n1)-c1nc([nH]c1-c1cccc(NS(=O)(=O)Cc2ccc(Cl)c(Cl)c2)c1)C1CC1
Show InChI InChI=1S/C24H22Cl2N6O2S/c1-27-24-28-10-9-20(29-24)22-21(30-23(31-22)15-6-7-15)16-3-2-4-17(12-16)32-35(33,34)13-14-5-8-18(25)19(26)11-14/h2-5,8-12,15,32H,6-7,13H2,1H3,(H,30,31)(H,27,28,29)
NCI pathway
Reactome pathway
n/an/a 26n/an/an/an/an/an/a
Johnson& Johnson Pharmaceutical Research& Development
Curated by ChEMBL
Assay Description
Inhibition of C-RAF kinase
Bioorg Med Chem Lett 18: 2825-9 (2008)
Article DOI: 10.1016/j.bmcl.2008.04.002
BindingDB Entry DOI: 10.7270/Q2DJ5GH8