BDBM50377878 CHEMBL258447
SMILES: Cc1ccc(cc1)C1(CC1)c1nnc2CCCCCCn12
InChI Key: InChIKey=XPVLBRLPRNDVHD-UHFFFAOYSA-N
Data: 4 IC50
Activity Spreadsheet -- Enzyme Inhibition Constant Data from BindingDB
Found 4 hits for monomerid = 50377878
Trg + Lig
Ki
nM
ΔG°
kcal/mole
IC50
nM
Kd
nM
EC50/IC50
nM
koff
s-1
kon
M-1s-1
pHTemp
°C
11-beta-hydroxysteroid dehydrogenase 1
(Homo sapiens (Human))
BDBM50377878
(CHEMBL258447)
Show SMILES Cc1ccc(cc1)C1(CC1)c1nnc2CCCCCCn12
Show InChI InChI=1S/C18H23N3/c1-14-7-9-15(10-8-14)18(11-12-18)17-20-19-16-6-4-2-3-5-13-21(16)17/h7-10H,2-6,11-13H2,1H3
Reactome pathway
n/an/a 1n/an/an/an/an/an/a
Merck Research Laboratories
Curated by ChEMBL
Assay Description
Inhibition of human 11-beta-HSD1 by SPA assay
Bioorg Med Chem Lett 18: 3412-6 (2008)
Article DOI: 10.1016/j.bmcl.2008.04.014
BindingDB Entry DOI: 10.7270/Q2H99625
11-beta-Hydroxysteroid Dehydrogenase 2 (11-beta-HSD2)
(Mus musculus (mouse))
BDBM50377878
(CHEMBL258447)
Show SMILES Cc1ccc(cc1)C1(CC1)c1nnc2CCCCCCn12
Show InChI InChI=1S/C18H23N3/c1-14-7-9-15(10-8-14)18(11-12-18)17-20-19-16-6-4-2-3-5-13-21(16)17/h7-10H,2-6,11-13H2,1H3
n/an/a>4.00E+3n/an/an/an/an/an/a
Merck Research Laboratories
Curated by ChEMBL
Assay Description
Inhibition of mouse 11-beta-HSD2 by SPA assay
Bioorg Med Chem Lett 18: 3412-6 (2008)
Article DOI: 10.1016/j.bmcl.2008.04.014
BindingDB Entry DOI: 10.7270/Q2H99625
11-beta-hydroxysteroid dehydrogenase 2
(Homo sapiens (Human))
BDBM50377878
(CHEMBL258447)
Show SMILES Cc1ccc(cc1)C1(CC1)c1nnc2CCCCCCn12
Show InChI InChI=1S/C18H23N3/c1-14-7-9-15(10-8-14)18(11-12-18)17-20-19-16-6-4-2-3-5-13-21(16)17/h7-10H,2-6,11-13H2,1H3
n/an/a>4.00E+3n/an/an/an/an/an/a
Merck Research Laboratories
Curated by ChEMBL
Assay Description
Inhibition of human 11-beta-HSD2 by SPA assay
Bioorg Med Chem Lett 18: 3412-6 (2008)
Article DOI: 10.1016/j.bmcl.2008.04.014
BindingDB Entry DOI: 10.7270/Q2H99625
11-beta-hydroxysteroid dehydrogenase 1
(Mus musculus (mouse))
BDBM50377878
(CHEMBL258447)
Show SMILES Cc1ccc(cc1)C1(CC1)c1nnc2CCCCCCn12
Show InChI InChI=1S/C18H23N3/c1-14-7-9-15(10-8-14)18(11-12-18)17-20-19-16-6-4-2-3-5-13-21(16)17/h7-10H,2-6,11-13H2,1H3
Reactome pathway
n/an/a 332n/an/an/an/an/an/a
Merck Research Laboratories
Curated by ChEMBL
Assay Description
Inhibition of mouse 11-beta-HSD1 by SPA assay
Bioorg Med Chem Lett 18: 3412-6 (2008)
Article DOI: 10.1016/j.bmcl.2008.04.014
BindingDB Entry DOI: 10.7270/Q2H99625