null
SMILES: [#7]\[#6](-[#7])=[#7]/[#6]-[#6]-[#6]-[#8]-c1ccc(-[#6]-[#6@H](-[#7]S(=O)(=O)c2cccc(c2)C(F)(F)F)-[#6](-[#8])=O)cc1-[#7]
InChI Key: InChIKey=LICKHERMNUKXHP-INIZCTEOSA-N
Activity Spreadsheet -- Enzyme Inhibition Constant Data from BindingDB
Found 2 hits for monomerid = 50378332
Trg + Lig
Ki
nM
ΔG°
kcal/mole
IC50
nM
Kd
nM
EC50/IC50
nM
koff
s-1
kon
M-1s-1
pHTemp
°C
Integrin alpha-V/beta-3
(Homo sapiens (Human))
BDBM50378332
(CHEMBL584165)
Show SMILES [#7]\[#6](-[#7])=[#7]/[#6]-[#6]-[#6]-[#8]-c1ccc(-[#6]-[#6@H](-[#7]S(=O)(=O)c2cccc(c2)C(F)(F)F)-[#6](-[#8])=O)cc1-[#7] |r|
Show InChI InChI=1S/C20H24F3N5O5S/c21-20(22,23)13-3-1-4-14(11-13)34(31,32)28-16(18(29)30)10-12-5-6-17(15(24)9-12)33-8-2-7-27-19(25)26/h1,3-6,9,11,16,28H,2,7-8,10,24H2,(H,29,30)(H4,25,26,27)/t16-/m0/s1
n/an/a 7.60n/an/an/an/an/an/a
Universite Catholique de Louvain
Curated by ChEMBL
Assay Description
Inhibition of human integrin alphav beta3 receptor by biotinylated vitronectin competitive binding assay
J Med Chem 52: 7029-43 (2009)
Article DOI: 10.1021/jm901133z
BindingDB Entry DOI: 10.7270/Q2GB2507
Integrin alpha-IIb/beta-3
(Homo sapiens (Human))
BDBM50378332
(CHEMBL584165)
Show SMILES [#7]\[#6](-[#7])=[#7]/[#6]-[#6]-[#6]-[#8]-c1ccc(-[#6]-[#6@H](-[#7]S(=O)(=O)c2cccc(c2)C(F)(F)F)-[#6](-[#8])=O)cc1-[#7] |r|
Show InChI InChI=1S/C20H24F3N5O5S/c21-20(22,23)13-3-1-4-14(11-13)34(31,32)28-16(18(29)30)10-12-5-6-17(15(24)9-12)33-8-2-7-27-19(25)26/h1,3-6,9,11,16,28H,2,7-8,10,24H2,(H,29,30)(H4,25,26,27)/t16-/m0/s1
n/an/a 27n/an/an/an/an/an/a
Universite Catholique de Louvain
Curated by ChEMBL
Assay Description
Inhibition of human integrin alpha2b beta3 receptor by fibrinogen competitive binding assay
J Med Chem 52: 7029-43 (2009)
Article DOI: 10.1021/jm901133z
BindingDB Entry DOI: 10.7270/Q2GB2507