BDBM50378663 CHEMBL1204015
SMILES: CN(C)CCN(C)C(=O)c1ccc(NC(=O)Nc2ccc(cc2)-c2nc(nc(n2)N2CCOCC2)N2CCOCC2)cc1
InChI Key: InChIKey=XMDPZWNVQRMVKQ-UHFFFAOYSA-N
Data: 3 IC50
Activity Spreadsheet -- Enzyme Inhibition Constant Data from BindingDB
Found 3 hits for monomerid = 50378663
Trg + Lig
Ki
nM
ΔG°
kcal/mole
IC50
nM
Kd
nM
EC50/IC50
nM
koff
s-1
kon
M-1s-1
pHTemp
°C
Serine/threonine-protein kinase mTOR
(Homo sapiens (Human))
BDBM50378663
(CHEMBL1204015)
Show SMILES CN(C)CCN(C)C(=O)c1ccc(NC(=O)Nc2ccc(cc2)-c2nc(nc(n2)N2CCOCC2)N2CCOCC2)cc1
Show InChI InChI=1S/C30H39N9O4/c1-36(2)12-13-37(3)27(40)23-6-10-25(11-7-23)32-30(41)31-24-8-4-22(5-9-24)26-33-28(38-14-18-42-19-15-38)35-29(34-26)39-16-20-43-21-17-39/h4-11H,12-21H2,1-3H3,(H2,31,32,41)
NCI pathway
Reactome pathway
n/an/a 0.600n/an/an/an/an/an/a
Wyeth Research
Curated by ChEMBL
Assay Description
Inhibition of mTOR
J Med Chem 53: 2636-45 (2010)
Article DOI: 10.1021/jm901830p
BindingDB Entry DOI: 10.7270/Q2862HDH
Phosphatidylinositol 4,5-bisphosphate 3-kinase catalytic subunit gamma isoform
(Homo sapiens (Human))
BDBM50378663
(CHEMBL1204015)
Show SMILES CN(C)CCN(C)C(=O)c1ccc(NC(=O)Nc2ccc(cc2)-c2nc(nc(n2)N2CCOCC2)N2CCOCC2)cc1
Show InChI InChI=1S/C30H39N9O4/c1-36(2)12-13-37(3)27(40)23-6-10-25(11-7-23)32-30(41)31-24-8-4-22(5-9-24)26-33-28(38-14-18-42-19-15-38)35-29(34-26)39-16-20-43-21-17-39/h4-11H,12-21H2,1-3H3,(H2,31,32,41)
NCI pathway
Reactome pathway
n/an/a 9n/an/an/an/an/an/a
Wyeth Research
Curated by ChEMBL
Assay Description
Inhibition of PI3Kgamma
J Med Chem 53: 2636-45 (2010)
Article DOI: 10.1021/jm901830p
BindingDB Entry DOI: 10.7270/Q2862HDH
Phosphatidylinositol 4,5-bisphosphate 3-kinase catalytic subunit alpha isoform
(Homo sapiens (Human))
BDBM50378663
(CHEMBL1204015)
Show SMILES CN(C)CCN(C)C(=O)c1ccc(NC(=O)Nc2ccc(cc2)-c2nc(nc(n2)N2CCOCC2)N2CCOCC2)cc1
Show InChI InChI=1S/C30H39N9O4/c1-36(2)12-13-37(3)27(40)23-6-10-25(11-7-23)32-30(41)31-24-8-4-22(5-9-24)26-33-28(38-14-18-42-19-15-38)35-29(34-26)39-16-20-43-21-17-39/h4-11H,12-21H2,1-3H3,(H2,31,32,41)
NCI pathway
Reactome pathway
n/an/a 0.400n/an/an/an/an/an/a
Wyeth Research
Curated by ChEMBL
Assay Description
Inhibition of PI3Kalpha
J Med Chem 53: 2636-45 (2010)
Article DOI: 10.1021/jm901830p
BindingDB Entry DOI: 10.7270/Q2862HDH