BDBM50378826 CHEMBL1241758
SMILES: O=C(Nc1cc(c[nH]1)C1CCC1)Nc1cccc2ccncc12
InChI Key: InChIKey=JAPIBZGEANTMOW-UHFFFAOYSA-N
Data: 2 IC50
Activity Spreadsheet -- Enzyme Inhibition Constant Data from BindingDB
Found 2 hits for monomerid = 50378826
Trg + Lig
Ki
nM
ΔG°
kcal/mole
IC50
nM
Kd
nM
EC50/IC50
nM
koff
s-1
kon
M-1s-1
pHTemp
°C
Cyclin-dependent-like kinase 5
(Homo sapiens (Human))
BDBM50378826
(CHEMBL1241758)
Show SMILES O=C(Nc1cc(c[nH]1)C1CCC1)Nc1cccc2ccncc12
Show InChI InChI=1S/C18H18N4O/c23-18(22-17-9-14(10-20-17)12-3-1-4-12)21-16-6-2-5-13-7-8-19-11-15(13)16/h2,5-12,20H,1,3-4H2,(H2,21,22,23)
NCI pathway
Reactome pathway
n/an/a 5n/an/an/an/an/an/a
Georgetown University
Curated by ChEMBL
Assay Description
Inhibition of CDK5
AAPS J 8: 204-21 (2006)
Article DOI: 10.1208/aapsj080125
BindingDB Entry DOI: 10.7270/Q2TX3GBS
Cyclin-dependent kinase 1
(Homo sapiens (Human))
BDBM50378826
(CHEMBL1241758)
Show SMILES O=C(Nc1cc(c[nH]1)C1CCC1)Nc1cccc2ccncc12
Show InChI InChI=1S/C18H18N4O/c23-18(22-17-9-14(10-20-17)12-3-1-4-12)21-16-6-2-5-13-7-8-19-11-15(13)16/h2,5-12,20H,1,3-4H2,(H2,21,22,23)
Reactome pathway
n/an/a 55n/an/an/an/an/an/a
Georgetown University
Curated by ChEMBL
Assay Description
Inhibition of CDK1
AAPS J 8: 204-21 (2006)
Article DOI: 10.1208/aapsj080125
BindingDB Entry DOI: 10.7270/Q2TX3GBS