BDBM50379090 CHEMBL2012527
SMILES: [#6]-[#6](-[#6])-[#6]-[#6@H](-[#7]-[#6](=O)-[#6@H](-[#6]-[#8])-[#7]-[#6](=O)-[#6@@H](-[#7]-[#6](=O)-[#6@@H]-1-[#6]-[#6]-[#6]-[#7]-1-[#6](=O)-[#6@@H](-[#7])-[#6]-[#6]-[#6]-[#6]-[#7])-[#6](-[#6])-[#6])-[#6](=O)-[#7]-[#6@@H](-[#6]-[#8])-[#6](=O)-[#7]-[#6@@H](-[#6]-c1ccc(-[#8])cc1)-[#6](=O)-[#7]-[#6@@H](-[#6]-[#6]-[#6]\[#7]=[#6](/[#7])-[#7])-[#6](=O)-[#7]-[#6]-[#6]-[#6]-[#6]-[#6@@H]-1-[#7]-[#6](=O)-[#6@H](-[#6]-[#6]-[#6]\[#7]=[#6](/[#7])-[#7])-[#7]-[#6](=O)-[#6@H](-[#6]-c2ccc(-[#8])cc2)-[#7]-[#6](=O)-[#6@@H]-2-[#6]-[#6]-[#6]-[#7]-2-[#6](=O)-[#6@@H](-[#6]-[#6]-[#6]-[#6]-[#7])-[#7]-[#6](=O)-[#6@H](-[#6]-[#6]-[#6]-[#6]-[#7])-[#7]-[#6](=O)-[#6@H](-[#6]-[#6]-[#6]\[#7]=[#6](\[#7])-[#7])-[#7]-[#6](=O)-[#6@H](-[#6]-c2ccc(-[#8])cc2)-[#7]-[#6](=O)-[#6@H](-[#6]-[#16]-[#16]-[#6]-[#6@H](-[#6]-[#6]-1=O)-[#6](=O)-[#7]-[#6@@H](-[#6]-[#6]-[#6]\[#7]=[#6](/[#7])-[#7])-[#6](-[#8])=O)-[#7]-[#6](=O)-[#6@H](-[#6]-c1ccc2ccccc2c1)-[#7]-[#6](=O)-[#6@H](-[#6]-[#6]-[#6]\[#7]=[#6](/[#7])-[#7])-[#7]-[#6](=O)-[#6@@H](-[#7])-[#6]-[#6]-[#6]\[#7]=[#6](\[#7])-[#7]
InChI Key: InChIKey=ILGNSCRKOXJWQI-IYNOOLQUSA-N
Data: 1 IC50
Activity Spreadsheet -- Enzyme Inhibition Constant Data from BindingDB
Found 1 hit for monomerid = 50379090
Trg + Lig
Ki
nM
ΔG°
kcal/mole
IC50
nM
Kd
nM
EC50/IC50
nM
koff
s-1
kon
M-1s-1
pHTemp
°C
C-X-C chemokine receptor type 4 (CXCR4)
(Homo sapiens (Human))
BDBM50379090
(CHEMBL2012527)
Show SMILES [#6]-[#6](-[#6])-[#6]-[#6@H](-[#7]-[#6](=O)-[#6@H](-[#6]-[#8])-[#7]-[#6](=O)-[#6@@H](-[#7]-[#6](=O)-[#6@@H]-1-[#6]-[#6]-[#6]-[#7]-1-[#6](=O)-[#6@@H](-[#7])-[#6]-[#6]-[#6]-[#6]-[#7])-[#6](-[#6])-[#6])-[#6](=O)-[#7]-[#6@@H](-[#6]-[#8])-[#6](=O)-[#7]-[#6@@H](-[#6]-c1ccc(-[#8])cc1)-[#6](=O)-[#7]-[#6@@H](-[#6]-[#6]-[#6]\[#7]=[#6](/[#7])-[#7])-[#6](=O)-[#7]-[#6]-[#6]-[#6]-[#6]-[#6@@H]-1-[#7]-[#6](=O)-[#6@H](-[#6]-[#6]-[#6]\[#7]=[#6](/[#7])-[#7])-[#7]-[#6](=O)-[#6@H](-[#6]-c2ccc(-[#8])cc2)-[#7]-[#6](=O)-[#6@@H]-2-[#6]-[#6]-[#6]-[#7]-2-[#6](=O)-[#6@@H](-[#6]-[#6]-[#6]-[#6]-[#7])-[#7]-[#6](=O)-[#6@H](-[#6]-[#6]-[#6]-[#6]-[#7])-[#7]-[#6](=O)-[#6@H](-[#6]-[#6]-[#6]\[#7]=[#6](\[#7])-[#7])-[#7]-[#6](=O)-[#6@H](-[#6]-c2ccc(-[#8])cc2)-[#7]-[#6](=O)-[#6@H](-[#6]-[#16]-[#16]-[#6]-[#6@H](-[#6]-[#6]-1=O)-[#6](=O)-[#7]-[#6@@H](-[#6]-[#6]-[#6]\[#7]=[#6](/[#7])-[#7])-[#6](-[#8])=O)-[#7]-[#6](=O)-[#6@H](-[#6]-c1ccc2ccccc2c1)-[#7]-[#6](=O)-[#6@H](-[#6]-[#6]-[#6]\[#7]=[#6](/[#7])-[#7])-[#7]-[#6](=O)-[#6@@H](-[#7])-[#6]-[#6]-[#6]\[#7]=[#6](\[#7])-[#7] |r|
Show InChI InChI=1S/C134H213N43O28S2/c1-74(2)63-96(167-121(197)102(71-179)173-125(201)107(75(3)4)175-124(200)105-36-21-61-176(105)126(202)87(139)25-7-11-51-135)115(191)172-101(70-178)120(196)169-97(65-76-38-45-83(180)46-39-76)116(192)161-89(30-16-56-154-130(142)143)110(186)152-54-14-10-27-88-106(183)69-82(108(184)166-95(128(204)205)34-20-60-158-134(150)151)72-206-207-73-103(174-119(195)100(68-79-37-44-80-23-5-6-24-81(80)64-79)168-114(190)91(31-17-57-155-131(144)145)160-109(185)86(138)26-15-55-153-129(140)141)122(198)170-98(66-77-40-47-84(181)48-41-77)117(193)164-93(33-19-59-157-133(148)149)112(188)162-90(28-8-12-52-136)113(189)165-94(29-9-13-53-137)127(203)177-62-22-35-104(177)123(199)171-99(67-78-42-49-85(182)50-43-78)118(194)163-92(111(187)159-88)32-18-58-156-132(146)147/h5-6,23-24,37-50,64,74-75,82,86-105,107,178-182H,7-22,25-36,51-63,65-73,135-139H2,1-4H3,(H,152,186)(H,159,187)(H,160,185)(H,161,192)(H,162,188)(H,163,194)(H,164,193)(H,165,189)(H,166,184)(H,167,197)(H,168,190)(H,169,196)(H,170,198)(H,171,199)(H,172,191)(H,173,201)(H,174,195)(H,175,200)(H,204,205)(H4,140,141,153)(H4,142,143,154)(H4,144,145,155)(H4,146,147,156)(H4,148,149,157)(H4,150,151,158)/t82-,86-,87-,88-,89-,90-,91-,92-,93-,94+,95-,96-,97-,98-,99-,100-,101-,102-,103-,104-,105-,107-/m0/s1
n/an/a 1.36n/an/an/an/an/an/a
TBA
Curated by ChEMBL
Assay Description
Displacement of [125I]-SDF-1alpha from human CXCR4 receptor expressed in HEK293 cells after 1 hr by gamma counting
ACS Med Chem Lett 2: 597-602 (2011)
Article DOI: 10.1021/ml200084n
BindingDB Entry DOI: 10.7270/Q2W096XP