BDBM50379178 CHEMBL2010833
SMILES: CN(C1CCN(Cc2ccc(cc2)C(F)(F)F)CC1)C(=O)Cc1ccc(c(F)c1)S(C)(=O)=O
InChI Key: InChIKey=XLRFNVGYXCZQNE-UHFFFAOYSA-N
Data: 1 IC50  1 EC50
Activity Spreadsheet -- Enzyme Inhibition Constant Data from BindingDB
Found 2 hits for monomerid = 50379178
Trg + Lig
Ki
nM
ΔG°
kcal/mole
IC50
nM
Kd
nM
EC50/IC50
nM
koff
s-1
kon
M-1s-1
pHTemp
°C
Potassium voltage-gated channel subfamily H member 2
(Homo sapiens (Human))
BDBM50379178
(CHEMBL2010833)
Show SMILES CN(C1CCN(Cc2ccc(cc2)C(F)(F)F)CC1)C(=O)Cc1ccc(c(F)c1)S(C)(=O)=O
Show InChI InChI=1S/C23H26F4N2O3S/c1-28(22(30)14-17-5-8-21(20(24)13-17)33(2,31)32)19-9-11-29(12-10-19)15-16-3-6-18(7-4-16)23(25,26)27/h3-8,13,19H,9-12,14-15H2,1-2H3
Reactome pathway
n/an/a 2.90E+3n/an/an/an/an/an/a
Astrazeneca U K Ltd
Curated by ChEMBL
Assay Description
Binding affinity to human ERG
Bioorg Med Chem Lett 21: 7310-6 (2011)
Article DOI: 10.1016/j.bmcl.2011.10.033
BindingDB Entry DOI: 10.7270/Q27945PF
G-protein coupled receptor 119 (GPR119)
(Homo sapiens (Human))
BDBM50379178
(CHEMBL2010833)
Show SMILES CN(C1CCN(Cc2ccc(cc2)C(F)(F)F)CC1)C(=O)Cc1ccc(c(F)c1)S(C)(=O)=O
Show InChI InChI=1S/C23H26F4N2O3S/c1-28(22(30)14-17-5-8-21(20(24)13-17)33(2,31)32)19-9-11-29(12-10-19)15-16-3-6-18(7-4-16)23(25,26)27/h3-8,13,19H,9-12,14-15H2,1-2H3
n/an/an/an/a 131n/an/an/an/a
Astrazeneca U K Ltd
Curated by ChEMBL
Assay Description
Agonist activity at human GPR119 receptor expressed in HEK293 cells assessed as cAMP accumulation after 45 mins by fluorescence assay
Bioorg Med Chem Lett 21: 7310-6 (2011)
Article DOI: 10.1016/j.bmcl.2011.10.033
BindingDB Entry DOI: 10.7270/Q27945PF