null
SMILES: CN(C1CCN(Cc2ccc(cc2)C(F)(F)F)CC1)C(=O)Cc1ccc(cc1F)S(C)(=O)=O
InChI Key: InChIKey=PJKKZSMSDDSMEJ-UHFFFAOYSA-N
Activity Spreadsheet -- Enzyme Inhibition Constant Data from BindingDB
Found 2 hits for monomerid = 50379179
Trg + Lig
Ki
nM
ΔG°
kcal/mole
IC50
nM
Kd
nM
EC50/IC50
nM
koff
s-1
kon
M-1s-1
pHTemp
°C
Potassium voltage-gated channel subfamily H member 2
(Homo sapiens (Human))
BDBM50379179
(CHEMBL2010832)
Show SMILES CN(C1CCN(Cc2ccc(cc2)C(F)(F)F)CC1)C(=O)Cc1ccc(cc1F)S(C)(=O)=O
Show InChI InChI=1S/C23H26F4N2O3S/c1-28(22(30)13-17-5-8-20(14-21(17)24)33(2,31)32)19-9-11-29(12-10-19)15-16-3-6-18(7-4-16)23(25,26)27/h3-8,14,19H,9-13,15H2,1-2H3
Reactome pathway
n/an/a 2.60E+3n/an/an/an/an/an/a
Astrazeneca U K Ltd
Curated by ChEMBL
Assay Description
Binding affinity to human ERG
Bioorg Med Chem Lett 21: 7310-6 (2011)
Article DOI: 10.1016/j.bmcl.2011.10.033
BindingDB Entry DOI: 10.7270/Q27945PF
Glucose-dependent insulinotropic receptor
(Homo sapiens (Human))
BDBM50379179
(CHEMBL2010832)
Show SMILES CN(C1CCN(Cc2ccc(cc2)C(F)(F)F)CC1)C(=O)Cc1ccc(cc1F)S(C)(=O)=O
Show InChI InChI=1S/C23H26F4N2O3S/c1-28(22(30)13-17-5-8-20(14-21(17)24)33(2,31)32)19-9-11-29(12-10-19)15-16-3-6-18(7-4-16)23(25,26)27/h3-8,14,19H,9-13,15H2,1-2H3
n/an/an/an/a 122n/an/an/an/a
Astrazeneca U K Ltd
Curated by ChEMBL
Assay Description
Agonist activity at human GPR119 receptor expressed in HEK293 cells assessed as cAMP accumulation after 45 mins by fluorescence assay
Bioorg Med Chem Lett 21: 7310-6 (2011)
Article DOI: 10.1016/j.bmcl.2011.10.033
BindingDB Entry DOI: 10.7270/Q27945PF