null
SMILES: Nc1ccnc(Nc2ccc(Oc3ccc(Cl)cc3)cc2)n1
InChI Key: InChIKey=XXQSOIJXIKSRGX-UHFFFAOYSA-N
Activity Spreadsheet -- Enzyme Inhibition Constant Data from BindingDB
Found 3 hits for monomerid = 50379396
Trg + Lig
Ki
nM
ΔG°
kcal/mole
IC50
nM
Kd
nM
EC50/IC50
nM
koff
s-1
kon
M-1s-1
pHTemp
°C
Potassium voltage-gated channel subfamily H member 2
(Homo sapiens (Human))
BDBM50379396
(CHEMBL2011950)
Show SMILES Nc1ccnc(Nc2ccc(Oc3ccc(Cl)cc3)cc2)n1
Show InChI InChI=1S/C16H13ClN4O/c17-11-1-5-13(6-2-11)22-14-7-3-12(4-8-14)20-16-19-10-9-15(18)21-16/h1-10H,(H3,18,19,20,21)
Reactome pathway
430n/an/an/an/an/an/an/an/a
Amgen Inc.
Curated by ChEMBL
Assay Description
Displacement of dofetilide from human ERG
Bioorg Med Chem Lett 22: 2033-42 (2012)
Article DOI: 10.1016/j.bmcl.2012.01.023
BindingDB Entry DOI: 10.7270/Q2S183H3
Sodium channel protein type 5 subunit alpha
(Homo sapiens (Human))
BDBM50379396
(CHEMBL2011950)
Show SMILES Nc1ccnc(Nc2ccc(Oc3ccc(Cl)cc3)cc2)n1
Show InChI InChI=1S/C16H13ClN4O/c17-11-1-5-13(6-2-11)22-14-7-3-12(4-8-14)20-16-19-10-9-15(18)21-16/h1-10H,(H3,18,19,20,21)
n/an/a 500n/an/an/an/an/an/a
Amgen Inc.
Curated by ChEMBL
Assay Description
Antagonist activity at human partially inactivated NaV 1.5 channel expressed in HEK293 cells by PatchXpress voltage patch clamp assay
Bioorg Med Chem Lett 22: 2033-42 (2012)
Article DOI: 10.1016/j.bmcl.2012.01.023
BindingDB Entry DOI: 10.7270/Q2S183H3
Sodium channel protein type 9 subunit alpha
(Homo sapiens (Human))
BDBM50379396
(CHEMBL2011950)
Show SMILES Nc1ccnc(Nc2ccc(Oc3ccc(Cl)cc3)cc2)n1
Show InChI InChI=1S/C16H13ClN4O/c17-11-1-5-13(6-2-11)22-14-7-3-12(4-8-14)20-16-19-10-9-15(18)21-16/h1-10H,(H3,18,19,20,21)
n/an/a 440n/an/an/an/an/an/a
Amgen Inc.
Curated by ChEMBL
Assay Description
Antagonist activity at human partially inactivated NaV 1.7 channel expressed in HEK293 cells by PatchXpress voltage patch clamp assay
Bioorg Med Chem Lett 22: 2033-42 (2012)
Article DOI: 10.1016/j.bmcl.2012.01.023
BindingDB Entry DOI: 10.7270/Q2S183H3