null
SMILES: Fc1cn(Cc2ccccc2)c2ncnc(OC3CCN(Cc4cscn4)CC3)c12
InChI Key: InChIKey=JAUQXVXTUFWMRU-UHFFFAOYSA-N
Activity Spreadsheet -- Enzyme Inhibition Constant Data from BindingDB
Found 3 hits for monomerid = 50379441
Trg + Lig
Ki
nM
ΔG°
kcal/mole
IC50
nM
Kd
nM
EC50/IC50
nM
koff
s-1
kon
M-1s-1
pHTemp
°C
Potassium voltage-gated channel subfamily H member 2
(Homo sapiens (Human))
BDBM50379441
(CHEMBL2012180)
Show SMILES Fc1cn(Cc2ccccc2)c2ncnc(OC3CCN(Cc4cscn4)CC3)c12
Show InChI InChI=1S/C22H22FN5OS/c23-19-12-28(10-16-4-2-1-3-5-16)21-20(19)22(25-14-24-21)29-18-6-8-27(9-7-18)11-17-13-30-15-26-17/h1-5,12-15,18H,6-11H2
Reactome pathway
2.50E+3n/an/an/an/an/an/an/an/a
Amgen Inc.
Curated by ChEMBL
Assay Description
Displacement of dofetilide from human ERG
Bioorg Med Chem Lett 22: 2052-62 (2012)
Article DOI: 10.1016/j.bmcl.2012.01.015
BindingDB Entry DOI: 10.7270/Q2HM59GC
Sodium channel protein type 9 subunit alpha
(Homo sapiens (Human))
BDBM50379441
(CHEMBL2012180)
Show SMILES Fc1cn(Cc2ccccc2)c2ncnc(OC3CCN(Cc4cscn4)CC3)c12
Show InChI InChI=1S/C22H22FN5OS/c23-19-12-28(10-16-4-2-1-3-5-16)21-20(19)22(25-14-24-21)29-18-6-8-27(9-7-18)11-17-13-30-15-26-17/h1-5,12-15,18H,6-11H2
n/an/a 60n/an/an/an/an/an/a
Amgen Inc.
Curated by ChEMBL
Assay Description
Antagonist activity at human NaV1.7 channel by patchXpress assay
Bioorg Med Chem Lett 22: 2052-62 (2012)
Article DOI: 10.1016/j.bmcl.2012.01.015
BindingDB Entry DOI: 10.7270/Q2HM59GC
Sodium channel protein type 5 subunit alpha
(Homo sapiens (Human))
BDBM50379441
(CHEMBL2012180)
Show SMILES Fc1cn(Cc2ccccc2)c2ncnc(OC3CCN(Cc4cscn4)CC3)c12
Show InChI InChI=1S/C22H22FN5OS/c23-19-12-28(10-16-4-2-1-3-5-16)21-20(19)22(25-14-24-21)29-18-6-8-27(9-7-18)11-17-13-30-15-26-17/h1-5,12-15,18H,6-11H2
n/an/a 30n/an/an/an/an/an/a
Amgen Inc.
Curated by ChEMBL
Assay Description
Antagonist activity at human NaV1.5 channel by patchXpress assay
Bioorg Med Chem Lett 22: 2052-62 (2012)
Article DOI: 10.1016/j.bmcl.2012.01.015
BindingDB Entry DOI: 10.7270/Q2HM59GC