null
SMILES: Clc1cccc(Cn2ccc3c(OC4CCN(Cc5cscn5)CC4)ncnc23)c1
InChI Key: InChIKey=WXZNLCQMGILZDR-UHFFFAOYSA-N
Activity Spreadsheet -- Enzyme Inhibition Constant Data from BindingDB
Found 3 hits for monomerid = 50379450
Trg + Lig
Ki
nM
ΔG°
kcal/mole
IC50
nM
Kd
nM
EC50/IC50
nM
koff
s-1
kon
M-1s-1
pHTemp
°C
Potassium voltage-gated channel subfamily H member 2
(Homo sapiens (Human))
BDBM50379450
(CHEMBL2012263)
Show SMILES Clc1cccc(Cn2ccc3c(OC4CCN(Cc5cscn5)CC4)ncnc23)c1
Show InChI InChI=1S/C22H22ClN5OS/c23-17-3-1-2-16(10-17)11-28-9-6-20-21(28)24-14-25-22(20)29-19-4-7-27(8-5-19)12-18-13-30-15-26-18/h1-3,6,9-10,13-15,19H,4-5,7-8,11-12H2
Reactome pathway
1.20E+3n/an/an/an/an/an/an/an/a
Amgen Inc.
Curated by ChEMBL
Assay Description
Displacement of dofetilide from human ERG
Bioorg Med Chem Lett 22: 2052-62 (2012)
Article DOI: 10.1016/j.bmcl.2012.01.015
BindingDB Entry DOI: 10.7270/Q2HM59GC
Sodium channel protein type 9 subunit alpha
(Homo sapiens (Human))
BDBM50379450
(CHEMBL2012263)
Show SMILES Clc1cccc(Cn2ccc3c(OC4CCN(Cc5cscn5)CC4)ncnc23)c1
Show InChI InChI=1S/C22H22ClN5OS/c23-17-3-1-2-16(10-17)11-28-9-6-20-21(28)24-14-25-22(20)29-19-4-7-27(8-5-19)12-18-13-30-15-26-18/h1-3,6,9-10,13-15,19H,4-5,7-8,11-12H2
n/an/a 70n/an/an/an/an/an/a
Amgen Inc.
Curated by ChEMBL
Assay Description
Antagonist activity at human NaV1.7 channel by patchXpress assay
Bioorg Med Chem Lett 22: 2052-62 (2012)
Article DOI: 10.1016/j.bmcl.2012.01.015
BindingDB Entry DOI: 10.7270/Q2HM59GC
Sodium channel protein type 5 subunit alpha
(Homo sapiens (Human))
BDBM50379450
(CHEMBL2012263)
Show SMILES Clc1cccc(Cn2ccc3c(OC4CCN(Cc5cscn5)CC4)ncnc23)c1
Show InChI InChI=1S/C22H22ClN5OS/c23-17-3-1-2-16(10-17)11-28-9-6-20-21(28)24-14-25-22(20)29-19-4-7-27(8-5-19)12-18-13-30-15-26-18/h1-3,6,9-10,13-15,19H,4-5,7-8,11-12H2
n/an/a 300n/an/an/an/an/an/a
Amgen Inc.
Curated by ChEMBL
Assay Description
Antagonist activity at human NaV1.5 channel by patchXpress assay
Bioorg Med Chem Lett 22: 2052-62 (2012)
Article DOI: 10.1016/j.bmcl.2012.01.015
BindingDB Entry DOI: 10.7270/Q2HM59GC