null
SMILES: Cc1cccnc1CN1CCC(CC1)Oc1ncnc2n(Cc3ccccc3)ccc12
InChI Key: InChIKey=TZUOZTCIJCIQGB-UHFFFAOYSA-N
Activity Spreadsheet -- Enzyme Inhibition Constant Data from BindingDB
Found 3 hits for monomerid = 50379467
Trg + Lig
Ki
nM
ΔG°
kcal/mole
IC50
nM
Kd
nM
EC50/IC50
nM
koff
s-1
kon
M-1s-1
pHTemp
°C
Potassium voltage-gated channel subfamily H member 2
(Homo sapiens (Human))
BDBM50379467
(CHEMBL2012293)
Show SMILES Cc1cccnc1CN1CCC(CC1)Oc1ncnc2n(Cc3ccccc3)ccc12
Show InChI InChI=1S/C25H27N5O/c1-19-6-5-12-26-23(19)17-29-13-9-21(10-14-29)31-25-22-11-15-30(24(22)27-18-28-25)16-20-7-3-2-4-8-20/h2-8,11-12,15,18,21H,9-10,13-14,16-17H2,1H3
Reactome pathway
730n/an/an/an/an/an/an/an/a
Amgen Inc.
Curated by ChEMBL
Assay Description
Displacement of dofetilide from human ERG
Bioorg Med Chem Lett 22: 2052-62 (2012)
Article DOI: 10.1016/j.bmcl.2012.01.015
BindingDB Entry DOI: 10.7270/Q2HM59GC
Sodium channel protein type 9 subunit alpha
(Homo sapiens (Human))
BDBM50379467
(CHEMBL2012293)
Show SMILES Cc1cccnc1CN1CCC(CC1)Oc1ncnc2n(Cc3ccccc3)ccc12
Show InChI InChI=1S/C25H27N5O/c1-19-6-5-12-26-23(19)17-29-13-9-21(10-14-29)31-25-22-11-15-30(24(22)27-18-28-25)16-20-7-3-2-4-8-20/h2-8,11-12,15,18,21H,9-10,13-14,16-17H2,1H3
n/an/a 190n/an/an/an/an/an/a
Amgen Inc.
Curated by ChEMBL
Assay Description
Antagonist activity at human NaV1.7 channel by patchXpress assay
Bioorg Med Chem Lett 22: 2052-62 (2012)
Article DOI: 10.1016/j.bmcl.2012.01.015
BindingDB Entry DOI: 10.7270/Q2HM59GC
Sodium channel protein type 5 subunit alpha
(Homo sapiens (Human))
BDBM50379467
(CHEMBL2012293)
Show SMILES Cc1cccnc1CN1CCC(CC1)Oc1ncnc2n(Cc3ccccc3)ccc12
Show InChI InChI=1S/C25H27N5O/c1-19-6-5-12-26-23(19)17-29-13-9-21(10-14-29)31-25-22-11-15-30(24(22)27-18-28-25)16-20-7-3-2-4-8-20/h2-8,11-12,15,18,21H,9-10,13-14,16-17H2,1H3
n/an/a 150n/an/an/an/an/an/a
Amgen Inc.
Curated by ChEMBL
Assay Description
Antagonist activity at human NaV1.5 channel by patchXpress assay
Bioorg Med Chem Lett 22: 2052-62 (2012)
Article DOI: 10.1016/j.bmcl.2012.01.015
BindingDB Entry DOI: 10.7270/Q2HM59GC