null
SMILES: C(N1CCC(CC1)Oc1ncnc2n(Cc3ccccc3)ccc12)c1ccccc1
InChI Key: InChIKey=BAOSULLFFBZYSX-UHFFFAOYSA-N
Activity Spreadsheet -- Enzyme Inhibition Constant Data from BindingDB
Found 3 hits for monomerid = 50379470
Trg + Lig
Ki
nM
ΔG°
kcal/mole
IC50
nM
Kd
nM
EC50/IC50
nM
koff
s-1
kon
M-1s-1
pHTemp
°C
Potassium voltage-gated channel subfamily H member 2
(Homo sapiens (Human))
BDBM50379470
(CHEMBL2012277)
Show SMILES C(N1CCC(CC1)Oc1ncnc2n(Cc3ccccc3)ccc12)c1ccccc1
Show InChI InChI=1S/C25H26N4O/c1-3-7-20(8-4-1)17-28-14-11-22(12-15-28)30-25-23-13-16-29(24(23)26-19-27-25)18-21-9-5-2-6-10-21/h1-10,13,16,19,22H,11-12,14-15,17-18H2
Reactome pathway
1.20E+3n/an/an/an/an/an/an/an/a
Amgen Inc.
Curated by ChEMBL
Assay Description
Displacement of dofetilide from human ERG
Bioorg Med Chem Lett 22: 2052-62 (2012)
Article DOI: 10.1016/j.bmcl.2012.01.015
BindingDB Entry DOI: 10.7270/Q2HM59GC
Sodium channel protein type 9 subunit alpha
(Homo sapiens (Human))
BDBM50379470
(CHEMBL2012277)
Show SMILES C(N1CCC(CC1)Oc1ncnc2n(Cc3ccccc3)ccc12)c1ccccc1
Show InChI InChI=1S/C25H26N4O/c1-3-7-20(8-4-1)17-28-14-11-22(12-15-28)30-25-23-13-16-29(24(23)26-19-27-25)18-21-9-5-2-6-10-21/h1-10,13,16,19,22H,11-12,14-15,17-18H2
n/an/a 1.10E+3n/an/an/an/an/an/a
Amgen Inc.
Curated by ChEMBL
Assay Description
Antagonist activity at human NaV1.7 channel by patchXpress assay
Bioorg Med Chem Lett 22: 2052-62 (2012)
Article DOI: 10.1016/j.bmcl.2012.01.015
BindingDB Entry DOI: 10.7270/Q2HM59GC
Sodium channel protein type 5 subunit alpha
(Homo sapiens (Human))
BDBM50379470
(CHEMBL2012277)
Show SMILES C(N1CCC(CC1)Oc1ncnc2n(Cc3ccccc3)ccc12)c1ccccc1
Show InChI InChI=1S/C25H26N4O/c1-3-7-20(8-4-1)17-28-14-11-22(12-15-28)30-25-23-13-16-29(24(23)26-19-27-25)18-21-9-5-2-6-10-21/h1-10,13,16,19,22H,11-12,14-15,17-18H2
n/an/a 740n/an/an/an/an/an/a
Amgen Inc.
Curated by ChEMBL
Assay Description
Antagonist activity at human NaV1.5 channel by patchXpress assay
Bioorg Med Chem Lett 22: 2052-62 (2012)
Article DOI: 10.1016/j.bmcl.2012.01.015
BindingDB Entry DOI: 10.7270/Q2HM59GC