BDBM50379740 CHEMBL2011132
SMILES: CNCCN1CCCCc2cc(ccc12)N=C(N)c1cccs1
InChI Key: InChIKey=XXFKDMTZCZDTMA-UHFFFAOYSA-N
Data: 3 IC50
Activity Spreadsheet -- Enzyme Inhibition Constant Data from BindingDB
Found 3 hits for monomerid = 50379740
Trg + Lig
Ki
nM
ΔG°
kcal/mole
IC50
nM
Kd
nM
EC50/IC50
nM
koff
s-1
kon
M-1s-1
pHTemp
°C
Nitric oxide synthase, brain
(Homo sapiens (Human))
BDBM50379740
(CHEMBL2011132)
Show SMILES CNCCN1CCCCc2cc(ccc12)N=C(N)c1cccs1 |w:15.16|
Show InChI InChI=1S/C18H24N4S/c1-20-9-11-22-10-3-2-5-14-13-15(7-8-16(14)22)21-18(19)17-6-4-12-23-17/h4,6-8,12-13,20H,2-3,5,9-11H2,1H3,(H2,19,21)
Reactome pathway
n/an/a 100n/an/an/an/an/an/a
NeurAxon Inc.
Curated by ChEMBL
Assay Description
Inhibition of human recombinant nNOS expressed in baculovirus infected insect sf9 cells assessed as conversion of [3H]-L-arginine into [3H]-L-citrull...
Bioorg Med Chem Lett 22: 2510-3 (2012)
Article DOI: 10.1016/j.bmcl.2012.02.004
BindingDB Entry DOI: 10.7270/Q2639QRG
Nitric oxide synthase, inducible
(Homo sapiens (Human))
BDBM50379740
(CHEMBL2011132)
Show SMILES CNCCN1CCCCc2cc(ccc12)N=C(N)c1cccs1 |w:15.16|
Show InChI InChI=1S/C18H24N4S/c1-20-9-11-22-10-3-2-5-14-13-15(7-8-16(14)22)21-18(19)17-6-4-12-23-17/h4,6-8,12-13,20H,2-3,5,9-11H2,1H3,(H2,19,21)
NCI pathway
Reactome pathway
n/an/a>1.00E+5n/an/an/an/an/an/a
NeurAxon Inc.
Curated by ChEMBL
Assay Description
Inhibition of human recombinant iNOS expressed in baculovirus infected insect sf9 cells assessed as conversion of [3H]-L-arginine into [3H]-L-citrull...
Bioorg Med Chem Lett 22: 2510-3 (2012)
Article DOI: 10.1016/j.bmcl.2012.02.004
BindingDB Entry DOI: 10.7270/Q2639QRG
Nitric oxide synthase, endothelial
(Homo sapiens (Human))
BDBM50379740
(CHEMBL2011132)
Show SMILES CNCCN1CCCCc2cc(ccc12)N=C(N)c1cccs1 |w:15.16|
Show InChI InChI=1S/C18H24N4S/c1-20-9-11-22-10-3-2-5-14-13-15(7-8-16(14)22)21-18(19)17-6-4-12-23-17/h4,6-8,12-13,20H,2-3,5,9-11H2,1H3,(H2,19,21)
n/an/a 4.71E+4n/an/an/an/an/an/a
NeurAxon Inc.
Curated by ChEMBL
Assay Description
Inhibition of human recombinant eNOS expressed in baculovirus infected insect sf9 cells assessed as conversion of [3H]-L-arginine into [3H]-L-citrull...
Bioorg Med Chem Lett 22: 2510-3 (2012)
Article DOI: 10.1016/j.bmcl.2012.02.004
BindingDB Entry DOI: 10.7270/Q2639QRG