BDBM50379762 CHEMBL2011348
SMILES: C1CN(CCO1)c1ccnc(Nc2ncc(s2)-c2cncc(c2)-c2cn[nH]c2)c1
InChI Key: InChIKey=AJRYTCKDSFVPCM-UHFFFAOYSA-N
Data: 1 IC50
Activity Spreadsheet -- Enzyme Inhibition Constant Data from BindingDB
Found 1 hit for monomerid = 50379762
Trg + Lig
Ki
nM
ΔG°
kcal/mole
IC50
nM
Kd
nM
EC50/IC50
nM
koff
s-1
kon
M-1s-1
pHTemp
°C
Serine/threonine-protein kinase Chk1
(Homo sapiens (Human))
BDBM50379762
(CHEMBL2011348)
Show SMILES C1CN(CCO1)c1ccnc(Nc2ncc(s2)-c2cncc(c2)-c2cn[nH]c2)c1
Show InChI InChI=1S/C20H19N7OS/c1-2-22-19(8-17(1)27-3-5-28-6-4-27)26-20-23-13-18(29-20)15-7-14(9-21-10-15)16-11-24-25-12-16/h1-2,7-13H,3-6H2,(H,24,25)(H,22,23,26)
Reactome pathway
n/an/a 35n/an/an/an/an/an/a
Merck Research Laboratories
Curated by ChEMBL
Assay Description
Competitive inhibition of Chk1 in presence of higher ATP levels
Bioorg Med Chem Lett 22: 2609-12 (2012)
Article DOI: 10.1016/j.bmcl.2012.01.110
BindingDB Entry DOI: 10.7270/Q22F7PFG
3D
3D Structure (docked)