BDBM50379867 CHEMBL2011877
SMILES: C[C@@H]1C[C@H]1C(=O)Nc1snc(c1C)-c1ccc(Br)cc1
InChI Key: InChIKey=ZSBBASZUYKREPU-PRHODGIISA-N
Data: 2 IC50
Activity Spreadsheet -- Enzyme Inhibition Constant Data from BindingDB
Found 2 hits for monomerid = 50379867
Trg + Lig
Ki
nM
ΔG°
kcal/mole
IC50
nM
Kd
nM
EC50/IC50
nM
koff
s-1
kon
M-1s-1
pHTemp
°C
Metabotropic glutamate receptor 5
(Homo sapiens (Human))
BDBM50379867
(CHEMBL2011877)
Show SMILES C[C@@H]1C[C@H]1C(=O)Nc1snc(c1C)-c1ccc(Br)cc1 |r|
Show InChI InChI=1S/C15H15BrN2OS/c1-8-7-12(8)14(19)17-15-9(2)13(18-20-15)10-3-5-11(16)6-4-10/h3-6,8,12H,7H2,1-2H3,(H,17,19)/t8-,12-/m1/s1
n/an/a 730n/an/an/an/an/an/a
Lilly Research Laboratories
Curated by ChEMBL
Assay Description
Antagonist activity at human mGluR5
Bioorg Med Chem Lett 22: 2514-7 (2012)
Article DOI: 10.1016/j.bmcl.2012.02.003
BindingDB Entry DOI: 10.7270/Q2RX9D3G
Metabotropic glutamate receptor 1
(Homo sapiens (Human))
BDBM50379867
(CHEMBL2011877)
Show SMILES C[C@@H]1C[C@H]1C(=O)Nc1snc(c1C)-c1ccc(Br)cc1 |r|
Show InChI InChI=1S/C15H15BrN2OS/c1-8-7-12(8)14(19)17-15-9(2)13(18-20-15)10-3-5-11(16)6-4-10/h3-6,8,12H,7H2,1-2H3,(H,17,19)/t8-,12-/m1/s1
n/an/a 7n/an/an/an/an/an/a
Lilly Research Laboratories
Curated by ChEMBL
Assay Description
Allosteric antagonist activity at human recombinant mGluR1 expressed in AV12 cells assessed as intracellular calcium concentration using Fluo-3 dye b...
Bioorg Med Chem Lett 22: 2514-7 (2012)
Article DOI: 10.1016/j.bmcl.2012.02.003
BindingDB Entry DOI: 10.7270/Q2RX9D3G