BDBM50380348 CHEMBL2017811
SMILES: COc1ccccc1C(=O)NC(=O)Nc1ccc(OCC(F)(F)F)c(c1)C(F)(F)F
InChI Key: InChIKey=MRZYTCCLGNJYKQ-UHFFFAOYSA-N
Data: 1 EC50
Activity Spreadsheet -- Enzyme Inhibition Constant Data from BindingDB
Found 1 hit for monomerid = 50380348
Trg + Lig
Ki
nM
ΔG°
kcal/mole
IC50
nM
Kd
nM
EC50/IC50
nM
koff
s-1
kon
M-1s-1
pHTemp
°C
Sphingosine 1-phosphate receptor 1
(Homo sapiens (Human))
BDBM50380348
(CHEMBL2017811)
Show SMILES COc1ccccc1C(=O)NC(=O)Nc1ccc(OCC(F)(F)F)c(c1)C(F)(F)F
Show InChI InChI=1S/C18H14F6N2O4/c1-29-13-5-3-2-4-11(13)15(27)26-16(28)25-10-6-7-14(30-9-17(19,20)21)12(8-10)18(22,23)24/h2-8H,9H2,1H3,(H2,25,26,27,28)
Reactome pathway
n/an/an/an/a 6.80n/an/an/an/a
TBA
Curated by ChEMBL
Assay Description
Agonist activity at human S1P1 expressed in U2OS cells coexpressing eGFP assessed as receptor internalisation after 1 hr by microscopic analysis
ACS Med Chem Lett 2: 752-757 (2011)
Article DOI: 10.1021/ml2001399
BindingDB Entry DOI: 10.7270/Q21837G0