BDBM50380934 CHEMBL2016885
SMILES: CCOc1cc(NCCN2CCCC2)c(C)c(c1)N1CCN(CC1)c1ncnc2n[nH]c(Br)c12
InChI Key: InChIKey=HNGORDVZNLENER-UHFFFAOYSA-N
Data: 4 IC50
Activity Spreadsheet -- Enzyme Inhibition Constant Data from BindingDB
Found 4 hits for monomerid = 50380934
Trg + Lig
Ki
nM
ΔG°
kcal/mole
IC50
nM
Kd
nM
EC50/IC50
nM
koff
s-1
kon
M-1s-1
pHTemp
°C
Ribosomal protein S6 kinase (P70S6K)
(Homo sapiens (Human))
BDBM50380934
(CHEMBL2016885)
Show SMILES CCOc1cc(NCCN2CCCC2)c(C)c(c1)N1CCN(CC1)c1ncnc2n[nH]c(Br)c12
Show InChI InChI=1S/C24H33BrN8O/c1-3-34-18-14-19(26-6-9-31-7-4-5-8-31)17(2)20(15-18)32-10-12-33(13-11-32)24-21-22(25)29-30-23(21)27-16-28-24/h14-16,26H,3-13H2,1-2H3,(H,27,28,29,30)
NCI pathway
Reactome pathway
n/an/a 2n/an/an/an/an/an/a
Exelixis
Curated by ChEMBL
Assay Description
Inhibition of p70S6K after 3 hrs by luciferase based chemiluminescence assay
Bioorg Med Chem Lett 22: 2693-7 (2012)
Article DOI: 10.1016/j.bmcl.2012.03.011
BindingDB Entry DOI: 10.7270/Q2WD41MT
RAC-alpha serine/threonine-protein kinase
(Homo sapiens (Human))
BDBM50380934
(CHEMBL2016885)
Show SMILES CCOc1cc(NCCN2CCCC2)c(C)c(c1)N1CCN(CC1)c1ncnc2n[nH]c(Br)c12
Show InChI InChI=1S/C24H33BrN8O/c1-3-34-18-14-19(26-6-9-31-7-4-5-8-31)17(2)20(15-18)32-10-12-33(13-11-32)24-21-22(25)29-30-23(21)27-16-28-24/h14-16,26H,3-13H2,1-2H3,(H,27,28,29,30)
n/an/a 9.07E+3n/an/an/an/an/an/a
Exelixis
Curated by ChEMBL
Assay Description
Inhibition of AKT1-mediated GSK3beta phosphorylation in human PC3 cells after 3 hrs by chemiluminescence assay
Bioorg Med Chem Lett 22: 2693-7 (2012)
Article DOI: 10.1016/j.bmcl.2012.03.011
BindingDB Entry DOI: 10.7270/Q2WD41MT
Ribosomal protein S6 kinase (P70S6K)
(Homo sapiens (Human))
BDBM50380934
(CHEMBL2016885)
Show SMILES CCOc1cc(NCCN2CCCC2)c(C)c(c1)N1CCN(CC1)c1ncnc2n[nH]c(Br)c12
Show InChI InChI=1S/C24H33BrN8O/c1-3-34-18-14-19(26-6-9-31-7-4-5-8-31)17(2)20(15-18)32-10-12-33(13-11-32)24-21-22(25)29-30-23(21)27-16-28-24/h14-16,26H,3-13H2,1-2H3,(H,27,28,29,30)
NCI pathway
Reactome pathway
n/an/a 197n/an/an/an/an/an/a
Exelixis
Curated by ChEMBL
Assay Description
Inhibition of p70S6K-mediated ribosomal protein S6 phosphorylation in human A549 cells after 3 hrs by chemiluminescence assay
Bioorg Med Chem Lett 22: 2693-7 (2012)
Article DOI: 10.1016/j.bmcl.2012.03.011
BindingDB Entry DOI: 10.7270/Q2WD41MT
RAC-alpha serine/threonine-protein kinase
(Homo sapiens (Human))
BDBM50380934
(CHEMBL2016885)
Show SMILES CCOc1cc(NCCN2CCCC2)c(C)c(c1)N1CCN(CC1)c1ncnc2n[nH]c(Br)c12
Show InChI InChI=1S/C24H33BrN8O/c1-3-34-18-14-19(26-6-9-31-7-4-5-8-31)17(2)20(15-18)32-10-12-33(13-11-32)24-21-22(25)29-30-23(21)27-16-28-24/h14-16,26H,3-13H2,1-2H3,(H,27,28,29,30)
n/an/a 56n/an/an/an/an/an/a
Exelixis
Curated by ChEMBL
Assay Description
Inhibition of AKT1 after 3 hrs by luciferase based chemiluminescence assay
Bioorg Med Chem Lett 22: 2693-7 (2012)
Article DOI: 10.1016/j.bmcl.2012.03.011
BindingDB Entry DOI: 10.7270/Q2WD41MT