BDBM50380995 CHEMBL2017111
SMILES: CC(=O)NCCc1ccccc1-c1onc([C@H]2CNCC[C@]2(C(N)=O)c2ccc(F)c(F)c2)c1Br
InChI Key: InChIKey=GMLLRQVRERMQBQ-CJAUYULYSA-N
Data: 1 KI  3 IC50
Activity Spreadsheet -- Enzyme Inhibition Constant Data from BindingDB
Found 4 hits for monomerid = 50380995
Trg + Lig
Ki
nM
ΔG°
kcal/mole
IC50
nM
Kd
nM
EC50/IC50
nM
koff
s-1
kon
M-1s-1
pHTemp
°C
Potassium voltage-gated channel subfamily H member 2
(Homo sapiens (Human))
BDBM50380995
(CHEMBL2017111)
Show SMILES CC(=O)NCCc1ccccc1-c1onc([C@H]2CNCC[C@]2(C(N)=O)c2ccc(F)c(F)c2)c1Br |r|
Show InChI InChI=1S/C25H25BrF2N4O3/c1-14(33)31-10-8-15-4-2-3-5-17(15)23-21(26)22(32-35-23)18-13-30-11-9-25(18,24(29)34)16-6-7-19(27)20(28)12-16/h2-7,12,18,30H,8-11,13H2,1H3,(H2,29,34)(H,31,33)/t18-,25+/m1/s1
Reactome pathway
3.00E+4n/an/an/an/an/an/an/an/a
Merck Frosst Centre for Therapeutic Research
Curated by ChEMBL
Assay Description
Binding affinity to human Erg
Bioorg Med Chem Lett 22: 2670-4 (2012)
Article DOI: 10.1016/j.bmcl.2012.03.014
BindingDB Entry DOI: 10.7270/Q2MW2J5S
Cytochrome P450 3A4
(Homo sapiens (Human))
BDBM50380995
(CHEMBL2017111)
Show SMILES CC(=O)NCCc1ccccc1-c1onc([C@H]2CNCC[C@]2(C(N)=O)c2ccc(F)c(F)c2)c1Br |r|
Show InChI InChI=1S/C25H25BrF2N4O3/c1-14(33)31-10-8-15-4-2-3-5-17(15)23-21(26)22(32-35-23)18-13-30-11-9-25(18,24(29)34)16-6-7-19(27)20(28)12-16/h2-7,12,18,30H,8-11,13H2,1H3,(H2,29,34)(H,31,33)/t18-,25+/m1/s1
Reactome pathway
n/an/a 3.60E+4n/an/an/an/an/an/a
Merck Frosst Centre for Therapeutic Research
Curated by ChEMBL
Assay Description
Reversible inhibition of CYP3A4-mediated conversion of testosterone to 6-beta-hydroxy-testosterone after 30 mins
Bioorg Med Chem Lett 22: 2670-4 (2012)
Article DOI: 10.1016/j.bmcl.2012.03.014
BindingDB Entry DOI: 10.7270/Q2MW2J5S
Renin
(Homo sapiens (Human))
BDBM50380995
(CHEMBL2017111)
Show SMILES CC(=O)NCCc1ccccc1-c1onc([C@H]2CNCC[C@]2(C(N)=O)c2ccc(F)c(F)c2)c1Br |r|
Show InChI InChI=1S/C25H25BrF2N4O3/c1-14(33)31-10-8-15-4-2-3-5-17(15)23-21(26)22(32-35-23)18-13-30-11-9-25(18,24(29)34)16-6-7-19(27)20(28)12-16/h2-7,12,18,30H,8-11,13H2,1H3,(H2,29,34)(H,31,33)/t18-,25+/m1/s1
Reactome pathway
n/an/a 0.220n/an/an/an/an/an/a
Merck Frosst Centre for Therapeutic Research
Curated by ChEMBL
Assay Description
Inhibition of human recombinant renin using DNP-Lys-His-Pro-Phe-His-Leu-Val-Ile-His-D,L-Amp as substrate after 3 hrs by fluorescence analysis
Bioorg Med Chem Lett 22: 2670-4 (2012)
Article DOI: 10.1016/j.bmcl.2012.03.014
BindingDB Entry DOI: 10.7270/Q2MW2J5S
Renin
(Homo sapiens (Human))
BDBM50380995
(CHEMBL2017111)
Show SMILES CC(=O)NCCc1ccccc1-c1onc([C@H]2CNCC[C@]2(C(N)=O)c2ccc(F)c(F)c2)c1Br |r|
Show InChI InChI=1S/C25H25BrF2N4O3/c1-14(33)31-10-8-15-4-2-3-5-17(15)23-21(26)22(32-35-23)18-13-30-11-9-25(18,24(29)34)16-6-7-19(27)20(28)12-16/h2-7,12,18,30H,8-11,13H2,1H3,(H2,29,34)(H,31,33)/t18-,25+/m1/s1
Reactome pathway
n/an/a 0.600n/an/an/an/an/an/a
Merck Frosst Centre for Therapeutic Research
Curated by ChEMBL
Assay Description
Inhibition of human recombinant renin using DNP-Lys-His-Pro-Phe-His-Leu-Val-Ile-His-D,L-Amp as substrate pretreated for 10 mins measured after 3 hrs ...
Bioorg Med Chem Lett 22: 2670-4 (2012)
Article DOI: 10.1016/j.bmcl.2012.03.014
BindingDB Entry DOI: 10.7270/Q2MW2J5S