BDBM50381253 CHEMBL2018670
SMILES: Cc1noc2c(Cc3ccc(cc3)[N+]([O-])=O)nn(Cc3n[nH]c(=S)n3C)c(=O)c12
InChI Key: InChIKey=LRWHVVRSHKMVRN-UHFFFAOYSA-N
Data: 2 IC50
Activity Spreadsheet -- Enzyme Inhibition Constant Data from BindingDB
Found 2 hits for monomerid = 50381253
Trg + Lig
Ki
nM
ΔG°
kcal/mole
IC50
nM
Kd
nM
EC50/IC50
nM
koff
s-1
kon
M-1s-1
pHTemp
°C
Prostaglandin G/H synthase 2
(Homo sapiens (Human))
BDBM50381253
(CHEMBL2018670)
Show SMILES Cc1noc2c(Cc3ccc(cc3)[N+]([O-])=O)nn(Cc3n[nH]c(=S)n3C)c(=O)c12
Show InChI InChI=1S/C17H15N7O4S/c1-9-14-15(28-21-9)12(7-10-3-5-11(6-4-10)24(26)27)20-23(16(14)25)8-13-18-19-17(29)22(13)2/h3-6H,7-8H2,1-2H3,(H,19,29)
NCI pathway
Reactome pathway
n/an/a 4.60E+3n/an/an/an/an/an/a
University of Hacettepe
Curated by ChEMBL
Assay Description
Inhibition of human recombinant COX2 by fluorescence assay
Bioorg Med Chem 20: 2912-22 (2012)
Article DOI: 10.1016/j.bmc.2012.03.021
BindingDB Entry DOI: 10.7270/Q2F76DKX
Prostaglandin G/H synthase 1
(Ovis aries (Sheep))
BDBM50381253
(CHEMBL2018670)
Show SMILES Cc1noc2c(Cc3ccc(cc3)[N+]([O-])=O)nn(Cc3n[nH]c(=S)n3C)c(=O)c12
Show InChI InChI=1S/C17H15N7O4S/c1-9-14-15(28-21-9)12(7-10-3-5-11(6-4-10)24(26)27)20-23(16(14)25)8-13-18-19-17(29)22(13)2/h3-6H,7-8H2,1-2H3,(H,19,29)
n/an/a 4.77E+4n/an/an/an/an/an/a
University of Hacettepe
Curated by ChEMBL
Assay Description
Inhibition of ovine COX1 by fluorescence assay
Bioorg Med Chem 20: 2912-22 (2012)
Article DOI: 10.1016/j.bmc.2012.03.021
BindingDB Entry DOI: 10.7270/Q2F76DKX