BDBM50381296 CHEMBL2019109
SMILES: COc1cc(ccc1-c1nc2snc(C3CCCCC3)c2c(=O)[nH]1)N1CCCC(O)CC1
InChI Key: InChIKey=VNTSPPBUMZJGMH-UHFFFAOYSA-N
Data: 1 IC50
Activity Spreadsheet -- Enzyme Inhibition Constant Data from BindingDB
Found 1 hit for monomerid = 50381296
Trg + Lig
Ki
nM
ΔG°
kcal/mole
IC50
nM
Kd
nM
EC50/IC50
nM
koff
s-1
kon
M-1s-1
pHTemp
°C
Phosphodiesterase 7
(Homo sapiens (Human))
BDBM50381296
(CHEMBL2019109)
Show SMILES COc1cc(ccc1-c1nc2snc(C3CCCCC3)c2c(=O)[nH]1)N1CCCC(O)CC1
Show InChI InChI=1S/C24H30N4O3S/c1-31-19-14-16(28-12-5-8-17(29)11-13-28)9-10-18(19)22-25-23(30)20-21(27-32-24(20)26-22)15-6-3-2-4-7-15/h9-10,14-15,17,29H,2-8,11-13H2,1H3,(H,25,26,30)
Reactome pathway
n/an/a 7n/an/an/an/an/an/a
Glenmark Pharmaceuticals Limited
Curated by ChEMBL
Assay Description
Displacement of [3H]-cAMP from human recombinant PDE7A
Bioorg Med Chem Lett 22: 3223-8 (2012)
Article DOI: 10.1016/j.bmcl.2012.03.025
BindingDB Entry DOI: 10.7270/Q2NP25F2