BDBM50381298 CHEMBL2019111
SMILES: CCOc1cc(O[C@@H]2CCNC2)ccc1-c1nc2snc(C3CCCCC3)c2c(=O)[nH]1
InChI Key: InChIKey=GFFIRXPJEGCULG-MRXNPFEDSA-N
Data: 1 IC50
Activity Spreadsheet -- Enzyme Inhibition Constant Data from BindingDB
Found 1 hit for monomerid = 50381298
Trg + Lig
Ki
nM
ΔG°
kcal/mole
IC50
nM
Kd
nM
EC50/IC50
nM
koff
s-1
kon
M-1s-1
pHTemp
°C
Phosphodiesterase 7
(Homo sapiens (Human))
BDBM50381298
(CHEMBL2019111)
Show SMILES CCOc1cc(O[C@@H]2CCNC2)ccc1-c1nc2snc(C3CCCCC3)c2c(=O)[nH]1 |r|
Show InChI InChI=1S/C23H28N4O3S/c1-2-29-18-12-15(30-16-10-11-24-13-16)8-9-17(18)21-25-22(28)19-20(27-31-23(19)26-21)14-6-4-3-5-7-14/h8-9,12,14,16,24H,2-7,10-11,13H2,1H3,(H,25,26,28)/t16-/m1/s1
Reactome pathway
n/an/a 35n/an/an/an/an/an/a
Glenmark Pharmaceuticals Limited
Curated by ChEMBL
Assay Description
Displacement of [3H]-cAMP from human recombinant PDE7A
Bioorg Med Chem Lett 22: 3223-8 (2012)
Article DOI: 10.1016/j.bmcl.2012.03.025
BindingDB Entry DOI: 10.7270/Q2NP25F2