BDBM50381326 CHEMBL2019141
SMILES: Nc1oc2cc(Cl)ccc2c(=O)c1-c1ccc(Cl)cc1
InChI Key: InChIKey=TZZXFPAUMVDPSZ-UHFFFAOYSA-N
Data: 2 IC50
Activity Spreadsheet -- Enzyme Inhibition Constant Data from BindingDB
Found 2 hits for monomerid = 50381326
Trg + Lig
Ki
nM
ΔG°
kcal/mole
IC50
nM
Kd
nM
EC50/IC50
nM
koff
s-1
kon
M-1s-1
pHTemp
°C
Carbonic anhydrase 2
(Homo sapiens (Human))
BDBM50381326
(CHEMBL2019141)
Show SMILES Nc1oc2cc(Cl)ccc2c(=O)c1-c1ccc(Cl)cc1
Show InChI InChI=1S/C15H9Cl2NO2/c16-9-3-1-8(2-4-9)13-14(19)11-6-5-10(17)7-12(11)20-15(13)18/h1-7H,18H2
Reactome pathway
n/an/a 8.25E+3n/an/an/an/an/an/a
Universit£ degli Studi di Cagliari
Curated by ChEMBL
Assay Description
Inhibition of cytosolic human carbonic anhydrase 2 preincubated for 15 mins by stopped flow CO2 hydration assay
Bioorg Med Chem Lett 22: 3063-6 (2012)
Article DOI: 10.1016/j.bmcl.2012.03.071
BindingDB Entry DOI: 10.7270/Q2J1045T
Carbonic anhydrase 1
(Homo sapiens (Human))
BDBM50381326
(CHEMBL2019141)
Show SMILES Nc1oc2cc(Cl)ccc2c(=O)c1-c1ccc(Cl)cc1
Show InChI InChI=1S/C15H9Cl2NO2/c16-9-3-1-8(2-4-9)13-14(19)11-6-5-10(17)7-12(11)20-15(13)18/h1-7H,18H2
NCI pathway
Reactome pathway
n/an/a 8.12E+3n/an/an/an/an/an/a
Universit£ degli Studi di Cagliari
Curated by ChEMBL
Assay Description
Inhibition of cytosolic human carbonic anhydrase 1 preincubated for 15 mins by stopped flow CO2 hydration assay
Bioorg Med Chem Lett 22: 3063-6 (2012)
Article DOI: 10.1016/j.bmcl.2012.03.071
BindingDB Entry DOI: 10.7270/Q2J1045T