null
SMILES: Cc1ccccc1NC(=O)Nc1ccc(cc1)-c1csc2c(cnc(N)c12)-c1cnn(C)c1
InChI Key: InChIKey=KRIMNORKYPAQGO-UHFFFAOYSA-N
Activity Spreadsheet -- Enzyme Inhibition Constant Data from BindingDB
Found 2 hits for monomerid = 50381699
Trg + Lig
Ki
nM
ΔG°
kcal/mole
IC50
nM
Kd
nM
EC50/IC50
nM
koff
s-1
kon
M-1s-1
pHTemp
°C
Vascular endothelial growth factor receptor 2
(Homo sapiens (Human))
BDBM50381699
(CHEMBL2023225)
Show SMILES Cc1ccccc1NC(=O)Nc1ccc(cc1)-c1csc2c(cnc(N)c12)-c1cnn(C)c1
Show InChI InChI=1S/C25H22N6OS/c1-15-5-3-4-6-21(15)30-25(32)29-18-9-7-16(8-10-18)20-14-33-23-19(12-27-24(26)22(20)23)17-11-28-31(2)13-17/h3-14H,1-2H3,(H2,26,27)(H2,29,30,32)
NCI pathway
Reactome pathway
n/an/a 2n/an/an/an/an/an/a
Abbott Laboratories
Curated by ChEMBL
Assay Description
Inhibition of human KDR phosphorylation expressed in mouse NIH3T3 cells
Bioorg Med Chem Lett 22: 3208-12 (2012)
Article DOI: 10.1016/j.bmcl.2012.03.035
BindingDB Entry DOI: 10.7270/Q2000336
Aurora kinase B
(Homo sapiens (Human))
BDBM50381699
(CHEMBL2023225)
Show SMILES Cc1ccccc1NC(=O)Nc1ccc(cc1)-c1csc2c(cnc(N)c12)-c1cnn(C)c1
Show InChI InChI=1S/C25H22N6OS/c1-15-5-3-4-6-21(15)30-25(32)29-18-9-7-16(8-10-18)20-14-33-23-19(12-27-24(26)22(20)23)17-11-28-31(2)13-17/h3-14H,1-2H3,(H2,26,27)(H2,29,30,32)
Reactome pathway
n/an/a 8n/an/an/an/an/an/a
Abbott Laboratories
Curated by ChEMBL
Assay Description
Inhibition of Aurora B using 1 mM ATP by HTRF assay
Bioorg Med Chem Lett 22: 3208-12 (2012)
Article DOI: 10.1016/j.bmcl.2012.03.035
BindingDB Entry DOI: 10.7270/Q2000336