BDBM50381916 CHEMBL2023111
SMILES: CC(C)(O)c1nc(no1)C1(CCC1)c1cccc2Nc3nc(ccc3CN(c12)S(=O)(=O)c1ccc(OC(F)(F)F)cc1)C(F)(F)F
InChI Key: InChIKey=AODCQIBERISBGK-UHFFFAOYSA-N
Data: 1 IC50  2 EC50
Activity Spreadsheet -- Enzyme Inhibition Constant Data from BindingDB
Found 3 hits for monomerid = 50381916
Trg + Lig
Ki
nM
ΔG°
kcal/mole
IC50
nM
Kd
nM
EC50/IC50
nM
koff
s-1
kon
M-1s-1
pHTemp
°C
Bombesin receptor subtype-3
(Mus musculus)
BDBM50381916
(CHEMBL2023111)
Show SMILES CC(C)(O)c1nc(no1)C1(CCC1)c1cccc2Nc3nc(ccc3CN(c12)S(=O)(=O)c1ccc(OC(F)(F)F)cc1)C(F)(F)F
Show InChI InChI=1S/C29H25F6N5O5S/c1-26(2,41)25-38-24(39-45-25)27(13-4-14-27)19-5-3-6-20-22(19)40(15-16-7-12-21(28(30,31)32)37-23(16)36-20)46(42,43)18-10-8-17(9-11-18)44-29(33,34)35/h3,5-12,41H,4,13-15H2,1-2H3,(H,36,37)
n/an/an/an/a 76n/an/an/an/a
Merck Research Laboratories
Curated by ChEMBL
Assay Description
Agonist activity at mouse BRS3 expressed in human HEK293AEQ cells measured for 10 mins by aequorin bioluminescence assay
Bioorg Med Chem 20: 2845-9 (2012)
Article DOI: 10.1016/j.bmc.2012.03.029
BindingDB Entry DOI: 10.7270/Q2F190R8
BRS3
(Homo sapiens (Human))
BDBM50381916
(CHEMBL2023111)
Show SMILES CC(C)(O)c1nc(no1)C1(CCC1)c1cccc2Nc3nc(ccc3CN(c12)S(=O)(=O)c1ccc(OC(F)(F)F)cc1)C(F)(F)F
Show InChI InChI=1S/C29H25F6N5O5S/c1-26(2,41)25-38-24(39-45-25)27(13-4-14-27)19-5-3-6-20-22(19)40(15-16-7-12-21(28(30,31)32)37-23(16)36-20)46(42,43)18-10-8-17(9-11-18)44-29(33,34)35/h3,5-12,41H,4,13-15H2,1-2H3,(H,36,37)
Reactome pathway
n/an/a 0.600n/an/an/an/an/an/a
Merck Research Laboratories
Curated by ChEMBL
Assay Description
Displacement of 125I-dY-peptide from human BRS3 expressed in NFAT-CHO cells after 2 hrs by liquid scintillation counting
Bioorg Med Chem 20: 2845-9 (2012)
Article DOI: 10.1016/j.bmc.2012.03.029
BindingDB Entry DOI: 10.7270/Q2F190R8
BRS3
(Homo sapiens (Human))
BDBM50381916
(CHEMBL2023111)
Show SMILES CC(C)(O)c1nc(no1)C1(CCC1)c1cccc2Nc3nc(ccc3CN(c12)S(=O)(=O)c1ccc(OC(F)(F)F)cc1)C(F)(F)F
Show InChI InChI=1S/C29H25F6N5O5S/c1-26(2,41)25-38-24(39-45-25)27(13-4-14-27)19-5-3-6-20-22(19)40(15-16-7-12-21(28(30,31)32)37-23(16)36-20)46(42,43)18-10-8-17(9-11-18)44-29(33,34)35/h3,5-12,41H,4,13-15H2,1-2H3,(H,36,37)
Reactome pathway
n/an/an/an/a 82n/an/an/an/a
Merck Research Laboratories
Curated by ChEMBL
Assay Description
Agonist activity at human BRS3 expressed in human HEK293AEQ cells measured for 10 mins by aequorin bioluminescence assay
Bioorg Med Chem 20: 2845-9 (2012)
Article DOI: 10.1016/j.bmc.2012.03.029
BindingDB Entry DOI: 10.7270/Q2F190R8