null
SMILES: COc1cc(Oc2ccnc3cc(F)ccc23)ccc1CC(=O)Nc1noc(C)c1C
InChI Key: InChIKey=KHQIHWMLBYCIHB-UHFFFAOYSA-N
Activity Spreadsheet -- Enzyme Inhibition Constant Data from BindingDB
Found 4 hits for monomerid = 50381921
Trg + Lig
Ki
nM
ΔG°
kcal/mole
IC50
nM
Kd
nM
EC50/IC50
nM
koff
s-1
kon
M-1s-1
pHTemp
°C
Platelet-derived growth factor receptor beta
(Homo sapiens (Human))
BDBM50381921
(CHEMBL2023480)
Show SMILES COc1cc(Oc2ccnc3cc(F)ccc23)ccc1CC(=O)Nc1noc(C)c1C
Show InChI InChI=1S/C23H20FN3O4/c1-13-14(2)31-27-23(13)26-22(28)10-15-4-6-17(12-21(15)29-3)30-20-8-9-25-19-11-16(24)5-7-18(19)20/h4-9,11-12H,10H2,1-3H3,(H,26,27,28)
NCI pathway
Reactome pathway
n/an/a 6n/an/an/an/an/an/a
AstraZeneca
Curated by ChEMBL
Assay Description
Inhibition of PDGFRbeta
Bioorg Med Chem Lett 22: 3050-5 (2012)
Article DOI: 10.1016/j.bmcl.2012.03.074
BindingDB Entry DOI: 10.7270/Q298881Z
Vascular endothelial growth factor receptor 2
(Homo sapiens (Human))
BDBM50381921
(CHEMBL2023480)
Show SMILES COc1cc(Oc2ccnc3cc(F)ccc23)ccc1CC(=O)Nc1noc(C)c1C
Show InChI InChI=1S/C23H20FN3O4/c1-13-14(2)31-27-23(13)26-22(28)10-15-4-6-17(12-21(15)29-3)30-20-8-9-25-19-11-16(24)5-7-18(19)20/h4-9,11-12H,10H2,1-3H3,(H,26,27,28)
NCI pathway
Reactome pathway
n/an/a>1.00E+4n/an/an/an/an/an/a
AstraZeneca
Curated by ChEMBL
Assay Description
Inhibition of KDR
Bioorg Med Chem Lett 22: 3050-5 (2012)
Article DOI: 10.1016/j.bmcl.2012.03.074
BindingDB Entry DOI: 10.7270/Q298881Z
Receptor-type tyrosine-protein kinase FLT3 [K633Q]
(Homo sapiens (Human))
BDBM50381921
(CHEMBL2023480)
Show SMILES COc1cc(Oc2ccnc3cc(F)ccc23)ccc1CC(=O)Nc1noc(C)c1C
Show InChI InChI=1S/C23H20FN3O4/c1-13-14(2)31-27-23(13)26-22(28)10-15-4-6-17(12-21(15)29-3)30-20-8-9-25-19-11-16(24)5-7-18(19)20/h4-9,11-12H,10H2,1-3H3,(H,26,27,28)
NCI pathway
Reactome pathway
n/an/a>1.00E+3n/an/an/an/an/an/a
AstraZeneca
Curated by ChEMBL
Assay Description
Inhibition of Flt3
Bioorg Med Chem Lett 22: 3050-5 (2012)
Article DOI: 10.1016/j.bmcl.2012.03.074
BindingDB Entry DOI: 10.7270/Q298881Z
Macrophage colony-stimulating factor 1 receptor
(Homo sapiens (Human))
BDBM50381921
(CHEMBL2023480)
Show SMILES COc1cc(Oc2ccnc3cc(F)ccc23)ccc1CC(=O)Nc1noc(C)c1C
Show InChI InChI=1S/C23H20FN3O4/c1-13-14(2)31-27-23(13)26-22(28)10-15-4-6-17(12-21(15)29-3)30-20-8-9-25-19-11-16(24)5-7-18(19)20/h4-9,11-12H,10H2,1-3H3,(H,26,27,28)
n/an/a>900n/an/an/an/an/an/a
AstraZeneca
Curated by ChEMBL
Assay Description
Inhibition of CSF-1R
Bioorg Med Chem Lett 22: 3050-5 (2012)
Article DOI: 10.1016/j.bmcl.2012.03.074
BindingDB Entry DOI: 10.7270/Q298881Z