null
SMILES: CCn1cc(NC(=O)Cc2ccc(Oc3ccnc4cc(F)ccc34)cc2OC)cn1
InChI Key: InChIKey=MPZNWDCJFYRKFH-UHFFFAOYSA-N
Activity Spreadsheet -- Enzyme Inhibition Constant Data from BindingDB
Found 4 hits for monomerid = 50381934
Trg + Lig
Ki
nM
ΔG°
kcal/mole
IC50
nM
Kd
nM
EC50/IC50
nM
koff
s-1
kon
M-1s-1
pHTemp
°C
Receptor-type tyrosine-protein kinase FLT3 [K633Q]
(Homo sapiens (Human))
BDBM50381934
(CHEMBL2023474)
Show SMILES CCn1cc(NC(=O)Cc2ccc(Oc3ccnc4cc(F)ccc34)cc2OC)cn1
Show InChI InChI=1S/C23H21FN4O3/c1-3-28-14-17(13-26-28)27-23(29)10-15-4-6-18(12-22(15)30-2)31-21-8-9-25-20-11-16(24)5-7-19(20)21/h4-9,11-14H,3,10H2,1-2H3,(H,27,29)
NCI pathway
Reactome pathway
n/an/a>1.00E+3n/an/an/an/an/an/a
AstraZeneca
Curated by ChEMBL
Assay Description
Inhibition of Flt3
Bioorg Med Chem Lett 22: 3050-5 (2012)
Article DOI: 10.1016/j.bmcl.2012.03.074
BindingDB Entry DOI: 10.7270/Q298881Z
Vascular endothelial growth factor receptor 2
(Homo sapiens (Human))
BDBM50381934
(CHEMBL2023474)
Show SMILES CCn1cc(NC(=O)Cc2ccc(Oc3ccnc4cc(F)ccc34)cc2OC)cn1
Show InChI InChI=1S/C23H21FN4O3/c1-3-28-14-17(13-26-28)27-23(29)10-15-4-6-18(12-22(15)30-2)31-21-8-9-25-20-11-16(24)5-7-19(20)21/h4-9,11-14H,3,10H2,1-2H3,(H,27,29)
NCI pathway
Reactome pathway
n/an/a 4.28E+3n/an/an/an/an/an/a
AstraZeneca
Curated by ChEMBL
Assay Description
Inhibition of KDR
Bioorg Med Chem Lett 22: 3050-5 (2012)
Article DOI: 10.1016/j.bmcl.2012.03.074
BindingDB Entry DOI: 10.7270/Q298881Z
Macrophage colony-stimulating factor 1 receptor
(Homo sapiens (Human))
BDBM50381934
(CHEMBL2023474)
Show SMILES CCn1cc(NC(=O)Cc2ccc(Oc3ccnc4cc(F)ccc34)cc2OC)cn1
Show InChI InChI=1S/C23H21FN4O3/c1-3-28-14-17(13-26-28)27-23(29)10-15-4-6-18(12-22(15)30-2)31-21-8-9-25-20-11-16(24)5-7-19(20)21/h4-9,11-14H,3,10H2,1-2H3,(H,27,29)
n/an/a 500n/an/an/an/an/an/a
AstraZeneca
Curated by ChEMBL
Assay Description
Inhibition of CSF-1R
Bioorg Med Chem Lett 22: 3050-5 (2012)
Article DOI: 10.1016/j.bmcl.2012.03.074
BindingDB Entry DOI: 10.7270/Q298881Z
Platelet-derived growth factor receptor beta
(Homo sapiens (Human))
BDBM50381934
(CHEMBL2023474)
Show SMILES CCn1cc(NC(=O)Cc2ccc(Oc3ccnc4cc(F)ccc34)cc2OC)cn1
Show InChI InChI=1S/C23H21FN4O3/c1-3-28-14-17(13-26-28)27-23(29)10-15-4-6-18(12-22(15)30-2)31-21-8-9-25-20-11-16(24)5-7-19(20)21/h4-9,11-14H,3,10H2,1-2H3,(H,27,29)
NCI pathway
Reactome pathway
n/an/a 6n/an/an/an/an/an/a
AstraZeneca
Curated by ChEMBL
Assay Description
Inhibition of PDGFRbeta
Bioorg Med Chem Lett 22: 3050-5 (2012)
Article DOI: 10.1016/j.bmcl.2012.03.074
BindingDB Entry DOI: 10.7270/Q298881Z