BDBM50381964 CHEMBL2022932
SMILES: CN(C)c1nc2nc3CCN(CC#C)Cc3c(N)c2cc1C#N
InChI Key: InChIKey=PYEGNFZGBZTQCZ-UHFFFAOYSA-N
Data: 4 IC50
Activity Spreadsheet -- Enzyme Inhibition Constant Data from BindingDB
Found 4 hits for monomerid = 50381964
Trg + Lig
Ki
nM
ΔG°
kcal/mole
IC50
nM
Kd
nM
EC50/IC50
nM
koff
s-1
kon
M-1s-1
pHTemp
°C
Acetylcholinesterase
(Electrophorus electricus (Electric eel))
BDBM50381964
(CHEMBL2022932)
Show SMILES CN(C)c1nc2nc3CCN(CC#C)Cc3c(N)c2cc1C#N
Show InChI InChI=1S/C17H18N6/c1-4-6-23-7-5-14-13(10-23)15(19)12-8-11(9-18)17(22(2)3)21-16(12)20-14/h1,8H,5-7,10H2,2-3H3,(H2,19,20,21)
n/an/a 29n/an/an/an/an/an/a
Laboratorio de Radicales Libres y Qu�mica Computacional (IQOG, CSIC)
Curated by ChEMBL
Assay Description
Inhibition of electric eel AChE using acetylthiocholine iodide as substrate after 15 mins by Ellman's method
Eur J Med Chem 52: 251-62 (2012)
Article DOI: 10.1016/j.ejmech.2012.03.022
BindingDB Entry DOI: 10.7270/Q25H7H97
Amine oxidase [flavin-containing] B
(Rattus norvegicus (rat))
BDBM50381964
(CHEMBL2022932)
Show SMILES CN(C)c1nc2nc3CCN(CC#C)Cc3c(N)c2cc1C#N
Show InChI InChI=1S/C17H18N6/c1-4-6-23-7-5-14-13(10-23)15(19)12-8-11(9-18)17(22(2)3)21-16(12)20-14/h1,8H,5-7,10H2,2-3H3,(H2,19,20,21)
n/an/a 2.81E+5n/an/an/an/an/an/a
Laboratorio de Radicales Libres y Qu�mica Computacional (IQOG, CSIC)
Curated by ChEMBL
Assay Description
Inhibition of mitochondrial MAO-B in rat liver homogenates using [14C]-phenylethylamine as substrate preincubated for 30 mins by liquid scintillation...
Eur J Med Chem 52: 251-62 (2012)
Article DOI: 10.1016/j.ejmech.2012.03.022
BindingDB Entry DOI: 10.7270/Q25H7H97
Amine oxidase [flavin-containing] A
(Rattus norvegicus (rat))
BDBM50381964
(CHEMBL2022932)
Show SMILES CN(C)c1nc2nc3CCN(CC#C)Cc3c(N)c2cc1C#N
Show InChI InChI=1S/C17H18N6/c1-4-6-23-7-5-14-13(10-23)15(19)12-8-11(9-18)17(22(2)3)21-16(12)20-14/h1,8H,5-7,10H2,2-3H3,(H2,19,20,21)
n/an/a 1.00E+6n/an/an/an/an/an/a
Laboratorio de Radicales Libres y Qu�mica Computacional (IQOG, CSIC)
Curated by ChEMBL
Assay Description
Inhibition of mitochondrial MAO-A in rat liver homogenates using [14C]-(5-hydroxy-triptamine) as substrate preincubated for 30 mins by liquid scintil...
Eur J Med Chem 52: 251-62 (2012)
Article DOI: 10.1016/j.ejmech.2012.03.022
BindingDB Entry DOI: 10.7270/Q25H7H97
Carboxylic ester hydrolase
(Equus caballus (Horse))
BDBM50381964
(CHEMBL2022932)
Show SMILES CN(C)c1nc2nc3CCN(CC#C)Cc3c(N)c2cc1C#N
Show InChI InChI=1S/C17H18N6/c1-4-6-23-7-5-14-13(10-23)15(19)12-8-11(9-18)17(22(2)3)21-16(12)20-14/h1,8H,5-7,10H2,2-3H3,(H2,19,20,21)
n/an/a>1.00E+5n/an/an/an/an/an/a
Laboratorio de Radicales Libres y Qu�mica Computacional (IQOG, CSIC)
Curated by ChEMBL
Assay Description
Inhibition of equine serum BChE using butyrylthiocholine iodide as substrate after 15 mins by Ellman's method
Eur J Med Chem 52: 251-62 (2012)
Article DOI: 10.1016/j.ejmech.2012.03.022
BindingDB Entry DOI: 10.7270/Q25H7H97