BDBM50382181 CHEMBL1894768::cid_684847
SMILES: C1Oc2ccc(Nc3nc(cs3)-c3ccccc3)cc2O1
InChI Key: InChIKey=VCCSHBSYIOMBBU-UHFFFAOYSA-N
Data: 1 IC50  2 EC50
Activity Spreadsheet -- Enzyme Inhibition Constant Data from BindingDB
Found 3 hits for monomerid = 50382181
Trg + Lig
Ki
nM
ΔG°
kcal/mole
IC50
nM
Kd
nM
EC50/IC50
nM
koff
s-1
kon
M-1s-1
pHTemp
°C
Oxysterols receptor LXR-beta
(Homo sapiens (Human))
BDBM50382181
(CHEMBL1894768 | cid_684847)
Show SMILES C1Oc2ccc(Nc3nc(cs3)-c3ccccc3)cc2O1
Show InChI InChI=1S/C16H12N2O2S/c1-2-4-11(5-3-1)13-9-21-16(18-13)17-12-6-7-14-15(8-12)20-10-19-14/h1-9H,10H2,(H,17,18)
PCBioAssay
n/an/an/an/a 6.76E+4n/an/an/an/a
The Scripps Research Institute Molecular Screening Center
Curated by PubChem BioAssay
Assay Description
Source (MLPCN Center Name): The Scripps Research Institute Molecular Screening Center Affiliation: UT Southwestern Assay Provider: David Mangelsdorf,...
PubChem Bioassay (2013)
BindingDB Entry DOI: 10.7270/Q23F4N80
Prostaglandin G/H synthase 2
(Homo sapiens (Human))
BDBM50382181
(CHEMBL1894768 | cid_684847)
Show SMILES C1Oc2ccc(Nc3nc(cs3)-c3ccccc3)cc2O1
Show InChI InChI=1S/C16H12N2O2S/c1-2-4-11(5-3-1)13-9-21-16(18-13)17-12-6-7-14-15(8-12)20-10-19-14/h1-9H,10H2,(H,17,18)
NCI pathway
Reactome pathway
n/an/a 410n/an/an/an/an/an/a
The University of Arizona
Curated by ChEMBL
Assay Description
Inhibition of COX2 by fluorescence assay
Bioorg Med Chem Lett 22: 3567-70 (2012)
Article DOI: 10.1016/j.bmcl.2012.03.013
BindingDB Entry DOI: 10.7270/Q2RB75MP
Nuclear hormone receptor family member daf-12
(Caenorhabditis elegans)
BDBM50382181
(CHEMBL1894768 | cid_684847)
Show SMILES C1Oc2ccc(Nc3nc(cs3)-c3ccccc3)cc2O1
Show InChI InChI=1S/C16H12N2O2S/c1-2-4-11(5-3-1)13-9-21-16(18-13)17-12-6-7-14-15(8-12)20-10-19-14/h1-9H,10H2,(H,17,18)
PCBioAssay
n/an/an/an/a 6.76E+4n/an/an/an/a
The Scripps Research Institute Molecular Screening Center
Curated by PubChem BioAssay
Assay Description
Source (MLPCN Center Name): The Scripps Research Institute Molecular Screening Center (SRIMSC) Affiliation: The Scripps Research Institute, TSRI Assa...
PubChem Bioassay (2013)
BindingDB Entry DOI: 10.7270/Q2BV7F8Z