BDBM50382190 CHEMBL2023850
SMILES: CN(c1nc(cs1)-c1ccc(Cl)cc1)c1ccc(O)cc1
InChI Key: InChIKey=FCEGYDMHSUAVRK-UHFFFAOYSA-N
Data: 1 IC50
Activity Spreadsheet -- Enzyme Inhibition Constant Data from BindingDB
Found 1 hit for monomerid = 50382190
Trg + Lig
Ki
nM
ΔG°
kcal/mole
IC50
nM
Kd
nM
EC50/IC50
nM
koff
s-1
kon
M-1s-1
pHTemp
°C
Cyclooxygenase
(Homo sapiens (Human))
BDBM50382190
(CHEMBL2023850)
Show SMILES CN(c1nc(cs1)-c1ccc(Cl)cc1)c1ccc(O)cc1
Show InChI InChI=1S/C16H13ClN2OS/c1-19(13-6-8-14(20)9-7-13)16-18-15(10-21-16)11-2-4-12(17)5-3-11/h2-10,20H,1H3
NCI pathway
Reactome pathway
n/an/a 1.08E+3n/an/an/an/an/an/a
The University of Arizona
Curated by ChEMBL
Assay Description
Inhibition of COX2 by fluorescence assay
Bioorg Med Chem Lett 22: 3567-70 (2012)
Article DOI: 10.1016/j.bmcl.2012.03.013
BindingDB Entry DOI: 10.7270/Q2RB75MP