BDBM50382323 CHEMBL2024690
SMILES: Cc1cccc(n1)-n1nccc1-c1ccc2nc[nH]c(=O)c2c1
InChI Key: InChIKey=QJNPMPKTEIRZQN-UHFFFAOYSA-N
Data: 2 IC50
Activity Spreadsheet -- Enzyme Inhibition Constant Data from BindingDB
Found 2 hits for monomerid = 50382323
Trg + Lig
Ki
nM
ΔG°
kcal/mole
IC50
nM
Kd
nM
EC50/IC50
nM
koff
s-1
kon
M-1s-1
pHTemp
°C
ALK5
(Mus musculus)
BDBM50382323
(CHEMBL2024690)
Show SMILES Cc1cccc(n1)-n1nccc1-c1ccc2nc[nH]c(=O)c2c1
Show InChI InChI=1S/C17H13N5O/c1-11-3-2-4-16(21-11)22-15(7-8-20-22)12-5-6-14-13(9-12)17(23)19-10-18-14/h2-10H,1H3,(H,18,19,23)
n/an/a 73n/an/an/an/an/an/a
Pfizer Inc.
Curated by ChEMBL
Assay Description
Inhibition of ALK5 in mouse NIH/3T3 cells by smad binding element reporter based assay
Bioorg Med Chem Lett 22: 3392-7 (2012)
Article DOI: 10.1016/j.bmcl.2012.04.013
BindingDB Entry DOI: 10.7270/Q2QC04H9
TGF-beta receptor type-1
(Homo sapiens (Human))
BDBM50382323
(CHEMBL2024690)
Show SMILES Cc1cccc(n1)-n1nccc1-c1ccc2nc[nH]c(=O)c2c1
Show InChI InChI=1S/C17H13N5O/c1-11-3-2-4-16(21-11)22-15(7-8-20-22)12-5-6-14-13(9-12)17(23)19-10-18-14/h2-10H,1H3,(H,18,19,23)
n/an/a 6n/an/an/an/an/an/a
Pfizer Inc.
Curated by ChEMBL
Assay Description
Inhibition of ALK5
Bioorg Med Chem Lett 22: 3392-7 (2012)
Article DOI: 10.1016/j.bmcl.2012.04.013
BindingDB Entry DOI: 10.7270/Q2QC04H9