BDBM50382443 CHEMBL2023351
SMILES: COc1cc2c(Oc3cc(NS(=O)(=O)c4cc(F)ccc4F)ccc3F)ccnc2cc1OCCCN1CCC(C)CC1
InChI Key: InChIKey=PDRYICFJQPVDPW-UHFFFAOYSA-N
Data: 1 IC50
Activity Spreadsheet -- Enzyme Inhibition Constant Data from BindingDB
Found 1 hit for monomerid = 50382443
Trg + Lig
Ki
nM
ΔG°
kcal/mole
IC50
nM
Kd
nM
EC50/IC50
nM
koff
s-1
kon
M-1s-1
pHTemp
°C
Tyrosine-protein kinase receptor UFO
(Homo sapiens (Human))
BDBM50382443
(CHEMBL2023351)
Show SMILES COc1cc2c(Oc3cc(NS(=O)(=O)c4cc(F)ccc4F)ccc3F)ccnc2cc1OCCCN1CCC(C)CC1
Show InChI InChI=1S/C31H32F3N3O5S/c1-20-9-13-37(14-10-20)12-3-15-41-30-19-26-23(18-29(30)40-2)27(8-11-35-26)42-28-17-22(5-7-24(28)33)36-43(38,39)31-16-21(32)4-6-25(31)34/h4-8,11,16-20,36H,3,9-10,12-15H2,1-2H3
n/an/a 16n/an/an/an/an/an/a
TBA
Curated by ChEMBL
Assay Description
Inhibition of human recombinant His-tagged AXL kinase using fluorescein-labelled poly-GT as substrate after 60 mins by TR-FRET analysis
ACS Med Chem Lett 2: 907-912 (2011)
Article DOI: 10.1021/ml200198x
BindingDB Entry DOI: 10.7270/Q2DZ099R