BDBM50383138 CHEMBL2031762
SMILES: C[C@@H]1CCCN1CCN1CCc2cc(ccc2C1=O)-c1ccc(cc1)C#N
InChI Key: InChIKey=TXFFWCPTQAOPNJ-QGZVFWFLSA-N
Data: 2 KI  1 IC50
Activity Spreadsheet -- Enzyme Inhibition Constant Data from BindingDB
Found 3 hits for monomerid = 50383138
Trg + Lig
Ki
nM
ΔG°
kcal/mole
IC50
nM
Kd
nM
EC50/IC50
nM
koff
s-1
kon
M-1s-1
pHTemp
°C
Histamine H3 receptor
(Homo sapiens (Human))
BDBM50383138
(CHEMBL2031762)
Show SMILES C[C@@H]1CCCN1CCN1CCc2cc(ccc2C1=O)-c1ccc(cc1)C#N |r|
Show InChI InChI=1S/C23H25N3O/c1-17-3-2-11-25(17)13-14-26-12-10-21-15-20(8-9-22(21)23(26)27)19-6-4-18(16-24)5-7-19/h4-9,15,17H,2-3,10-14H2,1H3/t17-/m1/s1
Reactome pathway
0.800n/an/an/an/an/an/an/an/a
Pfizer Inc.
Curated by ChEMBL
Assay Description
Displacement of [3H]-(R)-alpha-methylhistamine from human H3 receptor expressed in HEK293T cells after 120 mins by scintillation counting
J Med Chem 55: 2452-68 (2012)
Article DOI: 10.1021/jm300011d
BindingDB Entry DOI: 10.7270/Q2736RZR
Histamine H3 receptor
(Rattus norvegicus (rat))
BDBM50383138
(CHEMBL2031762)
Show SMILES C[C@@H]1CCCN1CCN1CCc2cc(ccc2C1=O)-c1ccc(cc1)C#N |r|
Show InChI InChI=1S/C23H25N3O/c1-17-3-2-11-25(17)13-14-26-12-10-21-15-20(8-9-22(21)23(26)27)19-6-4-18(16-24)5-7-19/h4-9,15,17H,2-3,10-14H2,1H3/t17-/m1/s1
Reactome pathway
5.80n/an/an/an/an/an/an/an/a
Pfizer Inc.
Curated by ChEMBL
Assay Description
Displacement of [3H]-(R)-alpha-methylhistamine from rat H3 receptor expressed in HEK293T cells after 120 mins by scintillation counting
J Med Chem 55: 2452-68 (2012)
Article DOI: 10.1021/jm300011d
BindingDB Entry DOI: 10.7270/Q2736RZR
Potassium voltage-gated channel subfamily H member 2
(Homo sapiens (Human))
BDBM50383138
(CHEMBL2031762)
Show SMILES C[C@@H]1CCCN1CCN1CCc2cc(ccc2C1=O)-c1ccc(cc1)C#N |r|
Show InChI InChI=1S/C23H25N3O/c1-17-3-2-11-25(17)13-14-26-12-10-21-15-20(8-9-22(21)23(26)27)19-6-4-18(16-24)5-7-19/h4-9,15,17H,2-3,10-14H2,1H3/t17-/m1/s1
Reactome pathway
n/an/a 140n/an/an/an/an/an/a
Pfizer Inc.
Curated by ChEMBL
Assay Description
Inhibition of human ERG by IonWorks assay
J Med Chem 55: 2452-68 (2012)
Article DOI: 10.1021/jm300011d
BindingDB Entry DOI: 10.7270/Q2736RZR