null
SMILES: COc1cc2nccc(Oc3ccc(NC(=O)C4CCN(C4=O)c4ccccc4)cc3F)c2cc1OC
InChI Key: InChIKey=GFMJATLKGABDIJ-UHFFFAOYSA-N
Activity Spreadsheet -- Enzyme Inhibition Constant Data from BindingDB
Found 2 hits for monomerid = 50383209
Trg + Lig
Ki
nM
ΔG°
kcal/mole
IC50
nM
Kd
nM
EC50/IC50
nM
koff
s-1
kon
M-1s-1
pHTemp
°C
Hepatocyte growth factor receptor
(Homo sapiens (Human))
BDBM50383209
(CHEMBL2032033)
Show SMILES COc1cc2nccc(Oc3ccc(NC(=O)C4CCN(C4=O)c4ccccc4)cc3F)c2cc1OC
Show InChI InChI=1S/C28H24FN3O5/c1-35-25-15-20-22(16-26(25)36-2)30-12-10-23(20)37-24-9-8-17(14-21(24)29)31-27(33)19-11-13-32(28(19)34)18-6-4-3-5-7-18/h3-10,12,14-16,19H,11,13H2,1-2H3,(H,31,33)
13.7n/an/an/an/an/an/an/an/a
Amgen Inc.
Curated by ChEMBL
Assay Description
Inhibition of recombinant c-met-mediated gastrin phosphorylation by HTRF assay
J Med Chem 55: 1858-67 (2012)
Article DOI: 10.1021/jm201330u
BindingDB Entry DOI: 10.7270/Q2ZK5HQP
Hepatocyte growth factor receptor
(Homo sapiens (Human))
BDBM50383209
(CHEMBL2032033)
Show SMILES COc1cc2nccc(Oc3ccc(NC(=O)C4CCN(C4=O)c4ccccc4)cc3F)c2cc1OC
Show InChI InChI=1S/C28H24FN3O5/c1-35-25-15-20-22(16-26(25)36-2)30-12-10-23(20)37-24-9-8-17(14-21(24)29)31-27(33)19-11-13-32(28(19)34)18-6-4-3-5-7-18/h3-10,12,14-16,19H,11,13H2,1-2H3,(H,31,33)
n/an/a 123n/an/an/an/an/an/a
Amgen Inc.
Curated by ChEMBL
Assay Description
Inhibition of HGF-mediated c-met autophosphorylation in serum-starved human PC3 cells after 1 hr by electrochemiluminescent immunoassay
J Med Chem 55: 1858-67 (2012)
Article DOI: 10.1021/jm201330u
BindingDB Entry DOI: 10.7270/Q2ZK5HQP