BDBM50383525 CHEMBL2032269
SMILES: ONC(=O)\C=C\c1ccc(cc1Cl)-c1cccnc1
InChI Key: InChIKey=DMGIYTRSTHPJCI-AATRIKPKSA-N
Data: 1 IC50
Activity Spreadsheet -- Enzyme Inhibition Constant Data from BindingDB
Found 1 hit for monomerid = 50383525
Trg + Lig
Ki
nM
ΔG°
kcal/mole
IC50
nM
Kd
nM
EC50/IC50
nM
koff
s-1
kon
M-1s-1
pHTemp
°C
Botulinum neurotoxin type A
(Clostridium botulinum)
BDBM50383525
(CHEMBL2032269)
Show SMILES ONC(=O)\C=C\c1ccc(cc1Cl)-c1cccnc1
Show InChI InChI=1S/C14H11ClN2O2/c15-13-8-11(12-2-1-7-16-9-12)4-3-10(13)5-6-14(18)17-19/h1-9,19H,(H,17,18)/b6-5+
NCI pathway
Reactome pathway
n/an/a 230n/an/an/an/an/an/a
Fox Chase Chemical Diversity Center
Curated by ChEMBL
Assay Description
Inhibition of clostridium botulinum Botulinum neurotoxin type A using SNAPide as substrate by FRET analysis
Bioorg Med Chem Lett 22: 3754-7 (2012)
Article DOI: 10.1016/j.bmcl.2012.04.019
BindingDB Entry DOI: 10.7270/Q21C1XWX