BDBM50383545 CHEMBL2032266
SMILES: ONC(=O)\C=C\c1ccc(cc1Cl)N1CCCCC1
InChI Key: InChIKey=IGJIZGAUADZAHY-FNORWQNLSA-N
Data: 1 IC50
Activity Spreadsheet -- Enzyme Inhibition Constant Data from BindingDB
Found 1 hit for monomerid = 50383545
Trg + Lig
Ki
nM
ΔG°
kcal/mole
IC50
nM
Kd
nM
EC50/IC50
nM
koff
s-1
kon
M-1s-1
pHTemp
°C
Botulinum neurotoxin type A
(Clostridium botulinum)
BDBM50383545
(CHEMBL2032266)
Show SMILES ONC(=O)\C=C\c1ccc(cc1Cl)N1CCCCC1
Show InChI InChI=1S/C14H17ClN2O2/c15-13-10-12(17-8-2-1-3-9-17)6-4-11(13)5-7-14(18)16-19/h4-7,10,19H,1-3,8-9H2,(H,16,18)/b7-5+
NCI pathway
Reactome pathway
n/an/a 1.13E+3n/an/an/an/an/an/a
Fox Chase Chemical Diversity Center
Curated by ChEMBL
Assay Description
Inhibition of clostridium botulinum Botulinum neurotoxin type A using SNAPide as substrate by FRET analysis
Bioorg Med Chem Lett 22: 3754-7 (2012)
Article DOI: 10.1016/j.bmcl.2012.04.019
BindingDB Entry DOI: 10.7270/Q21C1XWX