null
SMILES: CNc1cccc(CCCc2ccc(C[C@H](NC(=O)c3c(Cl)cccc3Cl)C(O)=O)s2)n1
InChI Key: InChIKey=NWOOORGYRVRDTD-IBGZPJMESA-N
Activity Spreadsheet -- Enzyme Inhibition Constant Data from BindingDB
Found 4 hits for monomerid = 50383802
Trg + Lig
Ki
nM
ΔG°
kcal/mole
IC50
nM
Kd
nM
EC50/IC50
nM
koff
s-1
kon
M-1s-1
pHTemp
°C
Integrin alpha-5/beta-1
(Homo sapiens (Human))
BDBM50383802
(CHEMBL2030964)
Show SMILES CNc1cccc(CCCc2ccc(C[C@H](NC(=O)c3c(Cl)cccc3Cl)C(O)=O)s2)n1 |r|
Show InChI InChI=1S/C23H23Cl2N3O3S/c1-26-20-10-3-6-14(27-20)5-2-7-15-11-12-16(32-15)13-19(23(30)31)28-22(29)21-17(24)8-4-9-18(21)25/h3-4,6,8-12,19H,2,5,7,13H2,1H3,(H,26,27)(H,28,29)(H,30,31)/t19-/m0/s1
n/an/a 180n/an/an/an/an/an/a
AstraZeneca
Curated by ChEMBL
Assay Description
Antagonist activity at integrin alpha5beta1 in human A375M cells assessed as inhibition of cell adhesion in presence of Mg2+ and MK-0429
Bioorg Med Chem Lett 22: 4117-21 (2012)
Article DOI: 10.1016/j.bmcl.2012.04.061
BindingDB Entry DOI: 10.7270/Q2M61M8P
Integrin alpha-5/beta-1
(Homo sapiens (Human))
BDBM50383802
(CHEMBL2030964)
Show SMILES CNc1cccc(CCCc2ccc(C[C@H](NC(=O)c3c(Cl)cccc3Cl)C(O)=O)s2)n1 |r|
Show InChI InChI=1S/C23H23Cl2N3O3S/c1-26-20-10-3-6-14(27-20)5-2-7-15-11-12-16(32-15)13-19(23(30)31)28-22(29)21-17(24)8-4-9-18(21)25/h3-4,6,8-12,19H,2,5,7,13H2,1H3,(H,26,27)(H,28,29)(H,30,31)/t19-/m0/s1
n/an/a 2n/an/an/an/an/an/a
AstraZeneca
Curated by ChEMBL
Assay Description
Binding affinity to integrin alpha5beta1
Bioorg Med Chem Lett 22: 4117-21 (2012)
Article DOI: 10.1016/j.bmcl.2012.04.061
BindingDB Entry DOI: 10.7270/Q2M61M8P
Integrin alpha-5/beta-1
(Homo sapiens (Human))
BDBM50383802
(CHEMBL2030964)
Show SMILES CNc1cccc(CCCc2ccc(C[C@H](NC(=O)c3c(Cl)cccc3Cl)C(O)=O)s2)n1 |r|
Show InChI InChI=1S/C23H23Cl2N3O3S/c1-26-20-10-3-6-14(27-20)5-2-7-15-11-12-16(32-15)13-19(23(30)31)28-22(29)21-17(24)8-4-9-18(21)25/h3-4,6,8-12,19H,2,5,7,13H2,1H3,(H,26,27)(H,28,29)(H,30,31)/t19-/m0/s1
n/an/a 31n/an/an/an/an/an/a
AstraZeneca
Curated by ChEMBL
Assay Description
Antagonist activity at integrin alpha5beta1 in human K562 cells assessed as inhibition of cell adhesion
Bioorg Med Chem Lett 22: 4117-21 (2012)
Article DOI: 10.1016/j.bmcl.2012.04.061
BindingDB Entry DOI: 10.7270/Q2M61M8P
Integrin alpha-V/beta-3
(Homo sapiens (Human))
BDBM50383802
(CHEMBL2030964)
Show SMILES CNc1cccc(CCCc2ccc(C[C@H](NC(=O)c3c(Cl)cccc3Cl)C(O)=O)s2)n1 |r|
Show InChI InChI=1S/C23H23Cl2N3O3S/c1-26-20-10-3-6-14(27-20)5-2-7-15-11-12-16(32-15)13-19(23(30)31)28-22(29)21-17(24)8-4-9-18(21)25/h3-4,6,8-12,19H,2,5,7,13H2,1H3,(H,26,27)(H,28,29)(H,30,31)/t19-/m0/s1
n/an/a 790n/an/an/an/an/an/a
AstraZeneca
Curated by ChEMBL
Assay Description
Antagonist activity at integrin alphaVbeta3 in human A375M cells assessed as cell adhesion to fibrinogen in presence of Mg2+
Bioorg Med Chem Lett 22: 4117-21 (2012)
Article DOI: 10.1016/j.bmcl.2012.04.061
BindingDB Entry DOI: 10.7270/Q2M61M8P